{"text_format":"1","workbook":"xlsx","n_sheets":3,"sheets":["Sheet1","Sheet2","Sheet3"],"not_rendered":{"charts":0,"images":0,"macros":1,"external_links":0,"defined_names":0,"comments":0,"pivot_tables":0},"unopened":[],"bounds":{"document_bytes":16777216,"sheet_cells":100000,"rows_first":2000,"rows_last":500,"rows_between":2000,"halvings":0,"cell_chars":16384,"cell_head_chars":4096},"cells_cut":0,"cells_raw":0,"read":"whole","date_system":"1900"}

{"sheet":"Sheet1","index":0,"n_rows":503,"n_cols":4,"rows_kept":503,"cut":false,"hidden":false,"merged":[]}
[]
[1,"熟字訓　読めるかな"]
[2,"意気地"]
[3,"意気地","いくじ"]
[4,"為替"]
[5,"為替","かわせ"]
[6,"乙女"]
[7,"乙女","おとめ"]
[8,"仮名"]
[9,"仮名","かな"]
[10,"海原"]
[11,"海原","うなばら"]
[12,"灰汁"]
[13,"灰汁","あく"]
[14,"灰汁","あく","食品に含まれる不快な成分。"]
[15,"寄席"]
[16,"寄席","よせ"]
[17,"景色"]
[18,"景色","けしき"]
[19,"玄人"]
[20,"玄人","くろうと"]
[21,"五月晴れ"]
[22,"五月晴れ","さつきばれ"]
[23,"行方"]
[24,"行方","ゆくえ"]
[25,"差し支える"]
[26,"差し支える","さしつかえる"]
[27,"砂利"]
[28,"砂利","じゃり"]
[29,"最寄り"]
[30,"最寄り","もより"]
[31,"雑魚"]
[32,"雑魚","ざこ"]
[33,"三味線"]
[34,"三味線","しゃみせん"]
[35,"桟敷"]
[36,"桟敷","さじき"]
[37,"芝生"]
[38,"芝生","しばふ"]
[39,"若人"]
[40,"若人","わこうど"]
[41,"十重二十重"]
[42,"十重二十重","とえはたえ"]
[43,"笑顔"]
[44,"笑顔","えがお"]
[45,"心地"]
[46,"心地","ここち"]
[47,"数寄屋"]
[48,"数寄屋","すきや"]
[49,"数珠"]
[50,"数珠","じゅず"]
[51,"素人"]
[52,"素人","しろうと"]
[53,"早苗"]
[54,"早苗","さなえ"]
[55,"草履"]
[56,"草履","ぞうり"]
[57,"息子"]
[58,"息子","むすこ"]
[59,"息吹"]
[60,"息吹","いぶき"]
[61,"稚児"]
[62,"稚児","ちご"]
[63,"築山"]
[64,"築山","つきやま"]
[65,"仲人"]
[66,"仲人","なこうど"]
[67,"伝馬船"]
[68,"伝馬船","てんません"]
[69,"投網"]
[70,"投網","とあみ"]
[71,"読経"]
[72,"読経","どきょう"]
[73,"凸凹"]
[74,"凸凹","でこぼこ"]
[75,"日和"]
[76,"日和","ひより"]
[77,"波止場"]
[78,"波止場","はとば"]
[79,"白髪"]
[80,"白髪","しらが"]
[81,"八百長"]
[82,"八百長","やおちょう"]
[83,"浮気"]
[84,"浮気","うわき"]
[85,"部屋"]
[86,"部屋","へや"]
[87,"風邪"]
[88,"風邪","かぜ"]
[89,"名残"]
[90,"名残","なごり"]
[91,"迷子"]
[92,"迷子","まいご"]
[93,"猛者"]
[94,"猛者","もさ"]
[95,"木綿"]
[96,"木綿","もめん"]
[97,"野良"]
[98,"野良","のら"]
[99,"立ち退く"]
[100,"立ち退く","たちのく"]
[101,"硫黄"]
[102,"硫黄","いおう"]
[103,"御神酒"]
[104,"御神酒","おみき"]
[105,"御神酒","おみき","神に供える酒。"]
[106,"一昨昨日"]
[107,"一昨昨日","さきおととい"]
[108,"一昨昨日","さきおととい","本日の３日前の日。"]
[109,"一昨日"]
[110,"一昨日","おととい"]
[111,"一昨日","おととい (いっさくじつ)","本日の２日前の日（前前日）。"]
[112,"一寸"]
[113,"一寸","ちょっと"]
[114,"一寸","ちょっと　(いっすん)","「ちょっと」は短い時間、「いっすん」は長さの単位で約３．０３ｃｍ。"]
[115,"一日"]
[116,"一日","ついたち"]
[117,"一日","ついたち　(いちにち、いちじつ)","１日。"]
[118,"烏賊"]
[119,"烏賊","いか"]
[120,"烏賊","いか","十本の腕の頭足類。"]
[121,"黄葉"]
[122,"黄葉","もみじ"]
[123,"黄葉","もみじ (こうよう)","秋に起こる落葉樹の葉の色が変わる現象。"]
[124,"下手"]
[125,"下手","へた　したて、しもて（ともに訓）"]
[126,"下手","へた　したて、しもて（ともに訓）","「へた」はうまくないこと、「したて」は遜ること、「しもて」は舞台のむかって左側のこと。"]
[127,"果物"]
[128,"果物","くだもの"]
[129,"果物","くだもの (かぶつ)","甘味や酸味の強い果実、特に樹木になるもの。"]
[130,"河岸"]
[131,"河岸","かし"]
[132,"河岸","かし (かわぎし）","「かし」は魚卸売市場、「かわぎし」は川の岸。"]
[133,"蚊帳"]
[134,"蚊帳","かや"]
[135,"蚊帳","かや","蚊から人を守るための箱状の網。"]
[136,"晦日"]
[137,"晦日","つごもり、みそか"]
[138,"晦日","つごもり、みそか　(かいじつ)","３０日または月末、大晦日は１２月３１日。"]
[139,"海月"]
[140,"海月","くらげ"]
[141,"海月","くらげ","浮遊生活を送る刺胞動物。"]
[142,"海女"]
[143,"海女","あま"]
[144,"海女","あま","海に潜り海産物を取る女性。"]
[145,"海老"]
[146,"海老","えび"]
[147,"海老","えび","甲殻類の動物。"]
[148,"角力"]
[149,"角力","すもう"]
[150,"角力","すもう","日本の伝統的な格闘技。"]
[151,"眼鏡"]
[152,"眼鏡","めがね"]
[153,"眼鏡","めがね（がんきょう）","視力を矯正する道具。"]
[154,"玄孫"]
[155,"玄孫","やしゃご"]
[156,"玄孫","やしゃご　(げんそん)","孫の孫。"]
[157,"五月"]
[158,"五月","さつき"]
[159,"五月","さつき　(ごがつ)","五月"]
[160,"五月雨"]
[161,"五月雨","さみだれ"]
[162,"五月雨","さみだれ","梅雨と同じ意味。"]
[163,"紅葉"]
[164,"紅葉","もみじ"]
[165,"紅葉","もみじ (こうよう)","秋に起こる落葉樹の葉の色が変わる現象。"]
[166,"今朝"]
[167,"今朝","けさ"]
[168,"今朝","けさ　(こんちょう)","今日の朝。"]
[169,"今日"]
[170,"今日","きょう"]
[171,"今日","きょう　(こんにち)","「きょう」は本日（ｔｈｉｓ　ｄａｙ）、「こんにち」は最近"]
[172,"今年"]
[173,"今年","ことし"]
[174,"今年","ことし　(こんねん)","本年。"]
[175,"昨日"]
[176,"昨日","きのう"]
[177,"昨日","きのう　(さくじつ)","本日の１日前の日（前日）。"]
[178,"皐月"]
[179,"皐月","さつき"]
[180,"皐月","さつき","五月"]
[181,"山葵"]
[182,"山葵","わさび"]
[183,"山葵","わさび","アブラナ科の植物。"]
[184,"山車"]
[185,"山車","だし"]
[186,"山車","だし","祭に使われる車輪を持った出し物。大勢で引く。"]
[187,"師走"]
[188,"師走","しわす、しはす"]
[189,"師走","しわす、しはす","１２月。"]
[190,"時雨"]
[191,"時雨","しぐれ"]
[192,"時雨","しぐれ","少しの間降る雨。"]
[193,"七夕"]
[194,"七夕","たなばた"]
[195,"七夕","たなばた　(しちせき)","７月７日またはその日に行われる祭り。"]
[196,"十六夜"]
[197,"十六夜","いざよい"]
[198,"十六夜","いざよい　(じゅうろくや)","満月の次の日の夜、そのとき出る月を指すことも。"]
[199,"従兄弟"]
[200,"従兄弟","いとこ"]
[201,"従兄弟","いとこ","父母の兄弟姉妹の子。"]
[202,"叔父"]
[203,"叔父","おじ"]
[204,"叔父","おじ　(しゅくふ)","父母の弟。"]
[205,"叔母"]
[206,"叔母","おば"]
[207,"叔母","おば　(しゅくぼ)","父母の妹。"]
[208,"祝詞"]
[209,"祝詞","のりと"]
[210,"祝詞","のりと","神に奉納するための言葉。"]
[211,"女形"]
[212,"女形","おやま"]
[213,"女形","おやま (おんながた)","女性を演じる男性の役者（歌舞伎・能など）。"]
[214,"女将"]
[215,"女将","おかみ"]
[216,"女将","おかみ　(じょしょう)","旅館や料理屋等の女主人。"]
[217,"女郎花"]
[218,"女郎花","おみなえし"]
[219,"女郎花","おみなえし","オミナエシ科の多年草"]
[220,"小豆"]
[221,"小豆","あずき"]
[222,"小豆","あずき","餡子の原料の豆。"]
[223,"松明"]
[224,"松明","たいまつ"]
[225,"松明","たいまつ","手で持てるようにした火のついた木切れ。"]
[226,"心太"]
[227,"心太","ところてん"]
[228,"心太","ところてん","海藻類を煮溶かし寒天質を冷まして固めた食品。"]
[229,"心天"]
[230,"心天","ところてん"]
[231,"心天","ところてん","海藻類を煮溶かし寒天質を冷まして固めた食品。"]
[232,"神楽"]
[233,"神楽","かぐら"]
[234,"神楽","かぐら","神に奉納するための歌と舞。"]
[235,"吹雪"]
[236,"吹雪","ふぶき"]
[237,"吹雪","ふぶき","風と雪が強いこと。"]
[238,"水母"]
[239,"水母","くらげ"]
[240,"水母","くらげ","浮遊生活を送る刺胞動物。"]
[241,"雪崩"]
[242,"雪崩","なだれ"]
[243,"雪崩","なだれ","雪が崩れること。"]
[244,"相撲"]
[245,"相撲","すもう"]
[246,"相撲","すもう","日本の伝統的な格闘技。"]
[247,"足袋"]
[248,"足袋","たび"]
[249,"足袋","たび","日本固有の伝統的な衣類で足に履く一種の下着。"]
[250,"太刀"]
[251,"太刀","たち"]
[252,"太刀","たち","刀。大きな刀、または、直刀でない刀。"]
[253,"大人"]
[254,"大人","おとな"]
[255,"大人","おとな　(だいにん)","成人。"]
[256,"大和"]
[257,"大和","やまと"]
[258,"大和","やまと (だいわ)","奈良県天理市付近の地域名、奈良県や日本全体を指すこともある。神奈川県に大和市（やまとし）がある。企業名では両方の読みがある。"]
[259,"鍛冶"]
[260,"鍛冶","かじ"]
[261,"鍛冶","かじ (たんや)","鍛造による金属製品の製作。鍛冶屋。"]
[262,"団扇"]
[263,"団扇","うちわ"]
[264,"団扇","うちわ","扇ぐことで風を起こせるようにした日本の伝統的な冷房器具。"]
[265,"竹刀"]
[266,"竹刀","しない"]
[267,"竹刀","しない (ちくとう)","竹でできた刀。"]
[268,"田舎"]
[269,"田舎","いなか"]
[270,"田舎","いなか (でんしゃ)","人口が疎で辺鄙な地域（いわゆる地方）。生まれ故郷。"]
[271,"土産"]
[272,"土産","みやげ"]
[273,"土産","みやげ","その土地の特産品、旅先で仕入れた品物、記念品。"]
[274,"土筆"]
[275,"土筆","つくし"]
[276,"土筆","つくし","スギナの胞子茎。"]
[277,"二十歳"]
[278,"二十歳","はたち"]
[279,"二十歳","はたち　(にじっさい)","２０才。"]
[280,"乳母"]
[281,"乳母","うば"]
[282,"乳母","うば","子供を育てるための人。"]
[283,"如月"]
[284,"如月","きさらぎ"]
[285,"如月","きさらぎ　(じょげつ)","２月。"]
[286,"梅雨"]
[287,"梅雨","つゆ"]
[288,"梅雨","つゆ (ばいう)","春と夏の間に多く雨が降る期間とその雨。"]
[289,"伯父"]
[290,"伯父","おじ"]
[291,"伯父","おじ　(はくふ)","父母の兄。"]
[292,"伯母"]
[293,"伯母","おば"]
[294,"伯母","おば　(はくぼ)","父母の姉。"]
[295,"百合"]
[296,"百合","ゆり"]
[297,"百合","ゆり","ユリ科の多年草。"]
[298,"百合花"]
[299,"百合花","ゆり"]
[300,"百合花","ゆり","ユリ科の多年草。"]
[301,"母屋"]
[302,"母屋","おもや"]
[303,"母屋","おもや","家の主となる建物。"]
[304,"明後日"]
[305,"明後日","あさって"]
[306,"明後日","あさって　(みょうごにち)","本日の２日後の日（翌翌日）。"]
[307,"明日"]
[308,"明日","あす、あした"]
[309,"明日","あす、あした　(みょうにち)","本日の１日後の日（翌日）"]
[310,"明明後日"]
[311,"明明後日","しあさって"]
[312,"明明後日","しあさって","本日の３日後の日。"]
[313,"弥生"]
[314,"弥生","やよい　　　"]
[315,"弥生","やよい　　　","３月。"]
[316,"陽炎"]
[317,"陽炎","かげろう"]
[318,"陽炎","かげろう (ようえん)","春及び夏に起こる気象現象。"]
[319,"浴衣"]
[320,"浴衣","ゆかた"]
[321,"浴衣","ゆかた (よくい)","単純な構造の和服。"]
[322,"流鏑馬"]
[323,"流鏑馬","やぶさめ"]
[324,"流鏑馬","やぶさめ","疾走する馬上から的に矢を射る弓術の稽古・儀式。"]
[325,"母家"]
[326,"母家","おもや"]
[327,"母家","おもや","家の主となる建物。"]
[328]
[329]
[330]
[331]
[332]
[333]
[334]
[335]
[336]
[337]
[338]
[339]
[340]
[341]
[342]
[343]
[344]
[345]
[346]
[347]
[348]
[349]
[350]
[351]
[352]
[353]
[354]
[355]
[356]
[357]
[358]
[359]
[360]
[361]
[362]
[363]
[364]
[365]
[366]
[367]
[368]
[369]
[370]
[371]
[372]
[373]
[374]
[375]
[376]
[377]
[378]
[379]
[380]
[381]
[382]
[383]
[384]
[385]
[386]
[387]
[388]
[389]
[390]
[391]
[392]
[393]
[394]
[395]
[396]
[397]
[398]
[399]
{"$rows_left_out":104}
{"sheet":"Sheet2","index":1,"n_rows":5,"n_cols":3,"rows_kept":5,"cut":false,"hidden":false,"merged":[[3,2,6,2]]}
[{"$f":"LEN(C2)","v":3},2]
[1,null,{"$f":"IF(VLOOKUP($B$1,Sheet1!$A$2:$H$1000000,2)=\"\",\"\",VLOOKUP($B$1,Sheet1!$A$2:$H$1000000,2))","v":"意気地"}]
[{"$f":"MAX(Sheet1!$A$2:$A$1048576)","v":502},null,{"$f":"\"  \"&IF(VLOOKUP($B$1,Sheet1!$A$2:$H$1000000,3)=\"\",\"\",VLOOKUP($B$1,Sheet1!$A$2:$H$1000000,3))","v":"  "}]
[{"$f":"LEN(C4)","v":2},null,{"$f":"\"  \"&IF(VLOOKUP($B$1,Sheet1!$A$2:$H$1000000,4)=\"\",\"\",VLOOKUP($B$1,Sheet1!$A$2:$H$1000000,4))","v":"  "}]
[{"$f":"LEN(C3)","v":2}]

{"sheet":"Sheet3","index":2,"n_rows":0,"n_cols":0,"rows_kept":0,"cut":false,"hidden":false,"merged":[]}