{"text_format":"1","workbook":"xlsx","n_sheets":3,"sheets":["敬語の問題","使いたい敬語","問題の元"],"not_rendered":{"charts":0,"images":0,"macros":1,"external_links":0,"defined_names":0,"comments":0,"pivot_tables":0},"unopened":[],"bounds":{"document_bytes":16777216,"sheet_cells":100000,"rows_first":2000,"rows_last":500,"rows_between":2000,"halvings":0,"cell_chars":16384,"cell_head_chars":4096},"cells_cut":0,"cells_raw":0,"read":"whole","date_system":"1900"}

{"sheet":"敬語の問題","index":0,"n_rows":21,"n_cols":6,"rows_kept":21,"cut":false,"hidden":false,"merged":[[1,5,7,20],[8,5,13,20],[14,5,19,20],[20,5,25,20],[1,3,7,3],[8,3,13,3],[14,3,19,3],[20,3,25,3]]}
[]
[1,null,false,"元の形",null,{"$f":"VLOOKUP($A$2,問題の元!$B$10:$F$39,2)","v":"用意"}]
[{"$f":"問題の元!$B$4","v":31}]
[]
[]
[]
[]
[]
[null,null,false,"尊敬語",null,{"$f":"IF(C9=TRUE,VLOOKUP($A$2,問題の元!$B$10:$F$39,3),\"\")","v":""}]
[null,null,-1]
[]
[]
[]
[]
[null,null,false,"謙譲語",null,{"$f":"IF(C15=TRUE,VLOOKUP($A$2,問題の元!$B$10:$F$39,4),\"\")","v":""}]
[]
[]
[]
[]
[]
[null,null,false,"丁寧語",null,{"$f":"IF(C21=TRUE,VLOOKUP($A$2,問題の元!$B$10:$F$39,5),\"\")","v":""}]

{"sheet":"使いたい敬語","index":1,"n_rows":24,"n_cols":6,"rows_kept":24,"cut":false,"hidden":false,"merged":[[22,2,23,2],[22,4,23,4],[22,5,23,5],[11,2,13,2],[11,5,13,5],[14,2,15,2],[14,4,15,4],[14,5,15,5],[19,2,21,2],[19,5,21,5]]}
[]
[]
[]
[]
[null,null,null,"尊敬語","謙譲語","丁寧語"]
[null,null,"会う","お会いになる","お目にかかる","会います"]
[null,null,"言う","おっしゃる","申し上げる","言います"]
[null,null,"行く","おいでになる","まいる・伺う","行きます"]
[null,null,"いる","いらっしゃる","おる","います"]
[null,null,"思う","お思いになる","存じる","思います"]
[null,null,"書く","お書きになる","書き申し上げる","書きます"]
[null,null,"聞く","お聞きになる","拝聴する","聞きます"]
[null,null,null,"聞かれる","うかがう"]
[null,null,null,null,"うけたまわる"]
[null,null,"来る","いらっしゃる","まいる","来ます"]
[null,null,null,"お見えになる"]
[null,null,"する","なさる","いたす","します"]
[null,null,"見る","ご覧になる","拝見する","見ます"]
[null,null,"食べる","召し上がる","いただく","食べます"]
[null,null,"電話する","お電話なさる","お電話する","電話します"]
[null,null,null,"お電話くださる","お電話いたす"]
[null,null,null,"電話される","お電話いただく"]
[null,null,"休む","お休みになる","お休みさせていただく","休みます"]
[null,null,null,"休まれる"]

{"sheet":"問題の元","index":2,"n_rows":40,"n_cols":6,"rows_kept":40,"cut":false,"hidden":false,"merged":[]}
[]
[]
[]
[null,{"$f":"MAX($B$10:$B$75)","v":31}]
[]
[]
[]
[null,null,"基本形","尊敬語","謙譲語","丁寧語"]
[null,null,"使用方法","目上の人に使う。相手を立てるときに使う。","自分をへりくだるときに使う。自分がへりくだることで、相手を立てる。","聞き手に対して丁寧に述べる言葉。 「です」「ます」「ございます」を付けて使う。相手・内容を問わない。"]
[null,1,"用意","・・・・・・","・・・・・・","・・・・・・"]
[null,2,"する","なさる、される","いたす","します"]
[null,3,"言う","おっしゃる、言われる","申し上げる","言います"]
[null,4,"行く","いらっしゃる、おいでになる","うかがう","行きます"]
[null,5,"来る","いらっしゃる、おいでになる、見える","参る","来ます"]
[null,6,"知る","ご存じだ","存じ上げる、承知しております","知っています"]
[null,7,"食べる","召し上がる、おあがりになる","いただく、頂戴する","食べます"]
[null,8,"いる","いらっしゃる、おいでになる","おる","います"]
[null,9,"見る","ご覧になる","拝見する","見ます"]
[null,10,"聞く","お聞きになる","拝聴する、うかがう","聞きます"]
[null,11,"座る","お掛けになる","お座りする","座ります"]
[null,12,"会う","お会いになる、会われる","お目にかかる","会います"]
[null,13,"伝える","お伝えになる","申し伝える","伝えます"]
[null,14,"わかる","おわかりになる、ご理解いただく","かしこまる、承知する","わかりました"]
[null,15,"読む","お読みになる","拝読する","読みます"]
[null,16,"与える","くださる","いただく、頂戴する","あげます、差し上げます"]
[null,17,"受け取る","お受け取りになる","賜る、頂戴する、拝受する","受けとります"]
[null,18,"利用する","ご利用になる","利用させていただく","利用します"]
[null,19,"思う","お思いになる、おぼし召す","存じ上げる、拝察する","思います"]
[null,20,"買う","お買いになる、お求めになる","買わせていただく","買います"]
[null,21,"考える","お考えになる、ご高察なさる","考えておる、拝察する","考えます"]
[null,22,"待つ","お待ちになる、お待ちくださる","お待ちする","待ちます"]
[null,23,"帰る","お帰りになる、帰られる","おいとまする","帰ります"]
[null,24,"家","御宅（おんたく）","拙宅（せったく）","-"]
[null,25,"会社","貴社（きしゃ）　御社（おんしゃ）","弊社（へいしゃ）","-"]
[null,26,"店","貴店（きてん）","弊店（へいてん）","-"]
[null,27,"銀行","貴行（きこう）","弊行（へいこう）","-"]
[null,28,"学校","貴校（きこう）","弊校（へいこう）","-"]
[null,29,"新聞","貴紙（きし）","弊紙（へいし）・小紙（しょうし）","-"]
[null,30,"雑誌","貴誌（きし）","弊誌（へいし）・小誌（しょうし）","-"]
[null,31,"地位","貴職（きしょく）","小職（しょうしょく）","-"]