{"text_format":"1","workbook":"xlsx","n_sheets":2,"sheets":["問題のシート","仕組みのシート"],"not_rendered":{"charts":0,"images":0,"macros":1,"external_links":0,"defined_names":0,"comments":0,"pivot_tables":0},"unopened":[],"bounds":{"document_bytes":16777216,"sheet_cells":100000,"rows_first":2000,"rows_last":500,"rows_between":2000,"halvings":0,"cell_chars":16384,"cell_head_chars":4096},"cells_cut":0,"cells_raw":0,"read":"whole","date_system":"1900"}

{"sheet":"問題のシート","index":0,"n_rows":17,"n_cols":11,"rows_kept":17,"cut":false,"hidden":false,"merged":[[1,10,2,15],[16,3,18,4],[3,8,3,9],[1,8,2,9],[9,7,10,7],[3,10,3,11],[4,8,4,9],[5,8,11,14]]}
[]
[null,null,1,null,null,null,null,null,{"$f":"\"第\"&$C$2&\"回\"","v":"第1回"},null,"1年生で学ぶ漢字"]
[]
[null,null,-1,null,null,null,null,null,{"$f":"IF($C$10=TRUE,\"書き\",\"読み\")","v":"読み"},null,{"$f":"ROUNDDOWN(C7/2+0.5,0)&\"問目\"","v":"1問目"}]
[null,null,null,null,null,null,null,null,{"$f":"F11","v":""}]
[null,null,null,null,null,null,null,null,{"$f":"D17","v":"握手"}]
[null,null,1,{"$f":"VLOOKUP($C$7,仕組みのシート!$R$6:$XFD$45,C2*2)","v":"握手"},{"$f":"VLOOKUP($C$7,仕組みのシート!$R$6:$XFD$45,C2*2+1)","v":"あくしゅ"}]
[null,null,null,{"$f":"VLOOKUP($C$7,仕組みのシート!$R$6:$XFD$45,C2*2)","v":"握手"},{"$f":"VLOOKUP($C$7,仕組みのシート!$R$6:$XFD$45,C2*2+1)","v":"あくしゅ"}]
[null,null,{"$f":"IF(C10=TRUE,1,0)","v":0}]
[null,null,{"$f":"IF($C$4=-1,FALSE,TRUE)","v":false},{"$f":"IF(D11<>\"\",1,0)","v":1},{"$f":"IF(E11<>\"\",1,0)","v":0},{"$f":"IF(AND(C10=TRUE,D10=1),\"答え\",\"\")","v":""},null,{"$f":"IF($C$7>=40,\"おしまい  \",\"\")","v":""}]
[null,null,{"$f":"MOD(C7+C9,2)","v":1},{"$f":"IF($C$11=1,D7,\"\")","v":"握手"},{"$f":"IF($C$12=1,E7,\"\")","v":""},{"$f":"F10&F13","v":""}]
[null,null,{"$f":"MOD(C7+C9,2)+1","v":2},{"$f":"IF($C$12=1,D8,\"\")","v":""},{"$f":"IF($C$11=1,E8,\"\")","v":"あくしゅ"}]
[null,null,null,{"$f":"IF(D12<>\"\",1,0)","v":0},{"$f":"IF(E12<>\"\",1,0)","v":1},{"$f":"IF(AND(C10=FALSE,D13=1),\"答え\",\"\")","v":""}]
[null,null,{"$f":"C11*C12+C12","v":4}]
[]
[]
[null,null,null,{"$f":"D11&E11","v":"握手"}]

{"sheet":"仕組みのシート","index":1,"n_rows":45,"n_cols":172,"rows_kept":45,"cut":false,"hidden":true,"merged":[]}
[]
[]
[null,null,null,null,null,null,null,null,null,null,null,null,null,null,null,null,null,{"$f":"MAX(S3:FP3)","v":92},{"$f":"IF(S6<>\"\",S2+1,\"\")","v":1},{"$f":"IF(T6<>\"\",S3+1,\"\")","v":2},{"$f":"IF(U6<>\"\",T3+1,\"\")","v":3},4,5,6,7,8,9,10,11,12,13,14,15,16,17,18,19,20,21,22,23,24,25,26,27,28,29,30,31,32,33,34,35,36,37,38,39,40,41,42,43,44,45,46,47,48,49,50,51,52,53,54,55,56,57,58,59,60,61,62,63,64,65,66,{"$f":"IF(CG6<>\"\",CF3+1,\"\")","v":67},68,69,70,71,72,73,74,75,76,77,78,79,80,81,82,83,84,85,86,87,88,89,90,91,92,"","","","","","","","","","","","","","","","","","","","","","","","","","","","","","","","","","","","","","",{"$f":"IF(ES6<>\"\",ER3+1,\"\")","v":""},"","","","","","","","","","","","","","","","","","","","","","",""]
[]
[null,null,null,null,null,null,null,null,null,"貼り付け位置",null,null,null,"〕","⇔"]
[null,null,null,null,null,null,null,null,null,"〔061〕　　汚い　　⇔　　きたない",null,null,{"$f":"LEN($J6)","v":18},{"$f":"FIND(N5,$J6)","v":5},{"$f":"FIND(O$5,$J6)","v":12},{"$f":"RIGHT(LEFT($J6,$O6-3),LEN(LEFT($J6,$O6-3))-7)","v":"汚い"},{"$f":"RIGHT(J6,(LEN(J6)-FIND(O$5,$J6)-2))","v":"きたない"},1,"握手","あくしゅ","見違える","みちがえる","鋭利","えいり","汚い","きたない","雅号","がごう","甘酒","あまざけ","鑑賞","かんしょう","輝き","かがやき","丘","おか","狂気","きょうき","仰ぐ","あおぐ","中継","ちゅうけい","圏内","けんない","互選","ごせん","香り","かおり","水彩画","すいさいが","名刺","めいし","傾斜","けいしゃ","需給","じゅきゅう","瞬時","しゅんじ","称する","しょうする","侵入","しんにゅう","薪","たきぎ","改姓","かいせい","僧院","そういん","交替","こうたい","嘆願書","たんがんしょ","蓄える","たくわえる","堤防","ていぼう","前途","ぜんと","遣唐使","けんとうし","闘志","とうし","悩む","なやむ","薄情","はくじょう","搬入","はんにゅう","避難","ひなん","恐怖","きょうふ","舞曲","ぶきょく","舗装","ほそう","冒す","おかす","妙に","みょうに","通信網","つうしんもう","水溶液","すいようえき","頼り","たより","近隣","きんりん","烈火","れっか"]
[null,null,null,null,null,null,null,null,null,null,null,null,null,null,null,{"$f":"P6","v":"汚い"},{"$f":"Q6","v":"きたない"},2,"握手",{"$f":"T6","v":"あくしゅ"},"見違える",{"$f":"V6","v":"みちがえる"},"鋭利",{"$f":"X6","v":"えいり"},"汚い","きたない","雅号",{"$f":"AB6","v":"がごう"},"甘酒",{"$f":"AD6","v":"あまざけ"},"鑑賞",{"$f":"AF6","v":"かんしょう"},"輝き","かがやき","丘","おか","狂気","きょうき","仰ぐ","あおぐ","中継","ちゅうけい","圏内","けんない","互選","ごせん","香り","かおり","水彩画","すいさいが","名刺","めいし","傾斜","けいしゃ","需給","じゅきゅう","瞬時","しゅんじ","称する","しょうする","侵入","しんにゅう","薪","たきぎ","改姓","かいせい","僧院","そういん","交替","こうたい","嘆願書","たんがんしょ","蓄える","たくわえる","堤防","ていぼう","前途","ぜんと","遣唐使","けんとうし","闘志","とうし","悩む","なやむ","薄情","はくじょう","搬入","はんにゅう","避難","ひなん","恐怖","きょうふ","舞曲","ぶきょく","舗装","ほそう","冒す","おかす","妙に","みょうに","通信網","つうしんもう","水溶液","すいようえき","頼り","たより","近隣","きんりん","烈火","れっか"]
[null,null,null,null,null,null,null,null,null,"〔062〕　　押す　　⇔　　おす",null,null,{"$f":"LEN($J8)","v":16},{"$f":"FIND(\"〕\",J8)","v":5},{"$f":"FIND(O$5,$J8)","v":12},{"$f":"RIGHT(LEFT($J8,$O8-3),LEN(LEFT($J8,$O8-3))-7)","v":"押す"},{"$f":"RIGHT(J8,(LEN(J8)-FIND(O$5,$J8)-2))","v":"おす"},3,"握力","あくりょく","繊維","せんい","鋭角","えいかく","押す","おす","介入","かいにゅう","甘える","あまえる","鑑定","かんてい","儀式",{"$f":"AH9","v":"ぎしき"},{"$f":"AI9","v":"不朽"},{"$f":"AJ9","v":"ふきゅう"},{"$f":"AK9","v":"熱狂"},{"$f":"AL9","v":"ねっきょう"},{"$f":"AM9","v":"駆使"},{"$f":"AN9","v":"くし"},{"$f":"AO9","v":"継ぐ"},{"$f":"AP9","v":"つぐ"},{"$f":"AQ9","v":"成層圏"},{"$f":"AR9","v":"せいそうけん"},{"$f":"AS9","v":"相互"},{"$f":"AT9","v":"そうご"},{"$f":"AU9","v":"項目"},{"$f":"AV9","v":"こうもく"},{"$f":"AW9","v":"多彩"},{"$f":"AX9","v":"たさい"},{"$f":"AY9","v":"刺激"},{"$f":"AZ9","v":"しげき"},"斜め","ななめ","需要","じゅよう","旬日","じゅんじつ","紹介","しょうかい","不可侵","ふかしん","尽力","じんりょく","百姓","ひゃくしょう","高僧","こうそう","衣替え","ころもがえ","嘆声","たんせい","沖合","おきあい","防波堤","ぼうはてい","渡航","とこう","唐草","からくさ","戦闘","せんとう","悩ます","なやます","薄命","はくめい","搬出","はんしゅつ","逃避","とうひ","怖い","こわい","見舞う","みまう","店舗","てんぽ","傍線","ぼうせん","不眠","ふみん","網戸","あみど","溶岩","ようがん","連絡","れんらく","隣","となり","熱烈","ねつれつ"]
[null,null,null,null,null,null,null,null,null,null,null,null,null,null,null,{"$f":"P8","v":"押す"},{"$f":"Q8","v":"おす"},4,"握力",{"$f":"T8","v":"あくりょく"},"繊維",{"$f":"V8","v":"せんい"},"鋭角",{"$f":"X8","v":"えいかく"},"押す","おす","介入",{"$f":"AB8","v":"かいにゅう"},"甘える",{"$f":"AD8","v":"あまえる"},"鑑定",{"$f":"AF8","v":"かんてい"},"儀式","ぎしき","不朽","ふきゅう","熱狂","ねっきょう","駆使","くし","継ぐ","つぐ","成層圏","せいそうけん","相互","そうご","項目","こうもく","多彩","たさい","刺激","しげき","斜め","ななめ","需要","じゅよう","旬日","じゅんじつ","紹介","しょうかい","不可侵","ふかしん","尽力","じんりょく","百姓","ひゃくしょう","高僧","こうそう","衣替え","ころもがえ","嘆声","たんせい","沖合","おきあい","防波堤","ぼうはてい","渡航","とこう","唐草","からくさ","戦闘","せんとう","悩ます","なやます","薄命","はくめい","搬出","はんしゅつ","逃避","とうひ","怖い","こわい","見舞う","みまう","店舗","てんぽ","傍線","ぼうせん","不眠","ふみん","網戸","あみど","溶岩","ようがん","連絡","れんらく","隣","となり","熱烈","ねつれつ"]
[null,null,null,null,null,null,null,null,null,"〔063〕　　押し合い　　⇔　　おしあい",null,null,{"$f":"LEN($J10)","v":20},{"$f":"FIND(\"〕\",J10)","v":5},{"$f":"FIND(O$5,$J10)","v":14},{"$f":"RIGHT(LEFT($J10,$O10-3),LEN(LEFT($J10,$O10-3))-7)","v":"押し合い"},{"$f":"RIGHT(J10,(LEN(J10)-FIND(O$5,$J10)-2))","v":"おしあい"},5,"掌握","しょうあく","維持","いじ","鋭い","するどい","押し合い","おしあい","紹介","しょうかい","発汗","はっかん","年鑑","ねんかん","礼儀",{"$f":"AH11","v":"れいぎ"},{"$f":"AI11","v":"老朽"},{"$f":"AJ11","v":"ろうきゅう"},{"$f":"AK11","v":"狂う"},{"$f":"AL11","v":"くるう"},{"$f":"AM11","v":"先駆"},{"$f":"AN11","v":"せんく"},{"$f":"AO11","v":"歓迎"},{"$f":"AP11","v":"かんげい"},{"$f":"AQ11","v":"北極圏"},{"$f":"AR11","v":"ほっきょくけん"},{"$f":"AS11","v":"互い"},{"$f":"AT11","v":"たがい"},{"$f":"AU11","v":"事項"},{"$f":"AV11","v":"じこう"},{"$f":"AW11","v":"歳末"},{"$f":"AX11","v":"さいまつ"},{"$f":"AY11","v":"刺身"},{"$f":"AZ11","v":"さしみ"},"煮る","にる","必需品","ひつじゅひん","上旬","じょうじゅん","詳細","しょうさい","侵す","おかす","尽きる","つきる","征服","せいふく","尼僧","にそう","両替","りょうがえ","嘆く","なげく","沖","おき","堤","つつみ","過渡期","かとき","桃源","とうげん","闘う","たたかう","濃度","のうど","薄い","うすい","運搬","うんぱん","避ける","さける","浮沈","ふちん","振幅","しんぷく","抱負","ほうふ","傍若","ぼうじゃく","冬眠","とうみん","黙殺","もくさつ","溶く","とく","脈絡","みゃくらく","感涙","かんるい","猛烈","もうれつ"]
[null,null,null,null,null,null,null,null,null,null,null,null,null,null,null,{"$f":"P10","v":"押し合い"},{"$f":"Q10","v":"おしあい"},6,"掌握",{"$f":"T10","v":"しょうあく"},"維持",{"$f":"V10","v":"いじ"},"鋭い",{"$f":"X10","v":"するどい"},"押し合い","おしあい","紹介",{"$f":"AB10","v":"しょうかい"},"発汗",{"$f":"AD10","v":"はっかん"},"年鑑",{"$f":"AF10","v":"ねんかん"},"礼儀","れいぎ","老朽","ろうきゅう","狂う","くるう","先駆","せんく","歓迎","かんげい","北極圏","ほっきょくけん","互い","たがい","事項","じこう","歳末","さいまつ","刺身","さしみ","煮る","にる","必需品","ひつじゅひん","上旬","じょうじゅん","詳細","しょうさい","侵す","おかす","尽きる","つきる","征服","せいふく","尼僧","にそう","両替","りょうがえ","嘆く","なげく","沖","おき","堤","つつみ","過渡期","かとき","桃源","とうげん","闘う","たたかう","濃度","のうど","薄い","うすい","運搬","うんぱん","避ける","さける","浮沈","ふちん","振幅","しんぷく","抱負","ほうふ","傍若","ぼうじゃく","冬眠","とうみん","黙殺","もくさつ","溶く","とく","脈絡","みゃくらく","感涙","かんるい","猛烈","もうれつ"]
[null,null,null,null,null,null,null,null,null,"〔064〕　　押さえる　　⇔　　おさえる",null,null,{"$f":"LEN($J12)","v":20},{"$f":"FIND(\"〕\",J12)","v":5},{"$f":"FIND(O$5,$J12)","v":14},{"$f":"RIGHT(LEFT($J12,$O12-3),LEN(LEFT($J12,$O12-3))-7)","v":"押さえる"},{"$f":"RIGHT(J12,(LEN(J12)-FIND(O$5,$J12)-2))","v":"おさえる"},7,"扱う","あつかう","維新","いしん","越境","えっきょう","押さえる","おさえる","介する","かいする","汗ばむ","あせばむ","含有","がんゆう","地球儀",{"$f":"AH13","v":"ちきゅうぎ"},{"$f":"AI13","v":"朽ちる"},{"$f":"AJ13","v":"くちる"},{"$f":"AK13","v":"状況"},{"$f":"AL13","v":"じょうきょう"},{"$f":"AM13","v":"駆ける"},{"$f":"AN13","v":"かける"},{"$f":"AO13","v":"送迎"},{"$f":"AP13","v":"そうげい"},{"$f":"AQ13","v":"堅実"},{"$f":"AR13","v":"けんじつ"},{"$f":"AS13","v":"抗争"},{"$f":"AT13","v":"こうそう"},{"$f":"AU13","v":"条項"},{"$f":"AV13","v":"じょうこう"},{"$f":"AW13","v":"六歳"},{"$f":"AX13","v":"ろくさい"},{"$f":"AY13","v":"刺さる"},{"$f":"AZ13","v":"ささる"},"雑煮","ぞうに","舟運","しゅううん","旬刊","じゅんかん","未詳","みしょう","振動","しんどう","尽くす","つくす","遠征","えんせい","乾燥","かんそう","光沢","こうたく","極端","きょくたん","跳馬","ちょうば","摘発","てきはつ","渡り鳥","わたりどり","桃色","ももいろ","胴体","どうたい","濃淡","のうたん","原爆","げんぱく","範囲","はんい","末尾","まつび","浮世絵","うきよえ","幅員","ふくいん","抱く","だく","傍観","ぼうかん","眠気","ねむけ","暗黙","あんもく","細腰","ほそごし","短絡的","たんらくてき","涙ぐむ","なみだぐむ","恋愛","れんあい"]
[null,null,null,null,null,null,null,null,null,null,null,null,null,null,null,{"$f":"P12","v":"押さえる"},{"$f":"Q12","v":"おさえる"},8,"扱う",{"$f":"T12","v":"あつかう"},"維新",{"$f":"V12","v":"いしん"},"越境",{"$f":"X12","v":"えっきょう"},"押さえる","おさえる","介する",{"$f":"AB12","v":"かいする"},"汗ばむ",{"$f":"AD12","v":"あせばむ"},"含有",{"$f":"AF12","v":"がんゆう"},"地球儀","ちきゅうぎ","朽ちる","くちる","状況","じょうきょう","駆ける","かける","送迎","そうげい","堅実","けんじつ","抗争","こうそう","条項","じょうこう","六歳","ろくさい","刺さる","ささる","雑煮","ぞうに","舟運","しゅううん","旬刊","じゅんかん","未詳","みしょう","振動","しんどう","尽くす","つくす","遠征","えんせい","乾燥","かんそう","光沢","こうたく","極端","きょくたん","跳馬","ちょうば","摘発","てきはつ","渡り鳥","わたりどり","桃色","ももいろ","胴体","どうたい","濃淡","のうたん","原爆","げんぱく","範囲","はんい","末尾","まつび","浮世絵","うきよえ","幅員","ふくいん","抱く","だく","傍観","ぼうかん","眠気","ねむけ","暗黙","あんもく","細腰","ほそごし","短絡的","たんらくてき","涙ぐむ","なみだぐむ","恋愛","れんあい"]
[null,null,null,null,null,null,null,null,null,"〔065〕　　奥　　⇔　　おく",null,null,{"$f":"LEN($J14)","v":15},{"$f":"FIND(\"〕\",J14)","v":5},{"$f":"FIND(O$5,$J14)","v":11},{"$f":"RIGHT(LEFT($J14,$O14-3),LEN(LEFT($J14,$O14-3))-7)","v":"奥"},{"$f":"RIGHT(J14,(LEN(J14)-FIND(O$5,$J14)-2))","v":"おく"},9,"客扱い","きゃくあつかい","経緯","けいい","越冬","えっとう","奥","おく","戒律","かいりつ","冷や汗","ひやあせ","含蓄","がんちく","戯曲",{"$f":"AH15","v":"ぎきょく"},{"$f":"AI15","v":"巨大"},{"$f":"AJ15","v":"きょだい"},{"$f":"AK15","v":"実況"},{"$f":"AL15","v":"じっきょう"},{"$f":"AM15","v":"屈託"},{"$f":"AN15","v":"くったく"},{"$f":"AO15","v":"出迎える"},{"$f":"AP15","v":"でむかえる"},{"$f":"AQ15","v":"中堅"},{"$f":"AR15","v":"ちゅうけん"},{"$f":"AS15","v":"抗議"},{"$f":"AT15","v":"こうぎ"},{"$f":"AU15","v":"草稿"},{"$f":"AV15","v":"そうこう"},{"$f":"AW15","v":"歳暮"},{"$f":"AX15","v":"せいぼ"},{"$f":"AY15","v":"脱脂綿"},{"$f":"AZ15","v":"だっしめん"},"煮物","にもの","渡し舟","わたしぶね","巡回","じゅんかい","詳しい","くわしい","手振り","てぶり","陣頭","じんとう","出征","しゅっせい","焦燥","しょうそう","沢ガニ","さわがに","端書き","はしがき","跳ねる","はねる","指摘","してき","奴隷","どれい","浸透","しんとう","胴衣","どうい","濃い","こい","爆発","ばくはつ","模範","もはん","接尾語","せつびご","浮き足","うきあし","横幅","よこはば","抱える","かかえる","帽子","ぼうし","矛盾","むじゅん","黙る","だまる","腰抜け","しぬけ　","欄干","らんかん","涙を呑む","なみだをのむ","失恋","しつれん"]
[null,null,null,null,null,null,null,null,null,null,null,null,null,null,null,{"$f":"P14","v":"奥"},{"$f":"Q14","v":"おく"},10,"客扱い",{"$f":"T14","v":"きゃくあつかい"},"経緯",{"$f":"V14","v":"けいい"},"越冬",{"$f":"X14","v":"えっとう"},"奥","おく","戒律",{"$f":"AB14","v":"かいりつ"},"冷や汗",{"$f":"AD14","v":"ひやあせ"},"含蓄",{"$f":"AF14","v":"がんちく"},"戯曲","ぎきょく","巨大","きょだい","実況","じっきょう","屈託","くったく","出迎える","でむかえる","中堅","ちゅうけん","抗議","こうぎ","草稿","そうこう","歳暮","せいぼ","脱脂綿","だっしめん","煮物","にもの","渡し舟","わたしぶね","巡回","じゅんかい","詳しい","くわしい","手振り","てぶり","陣頭","じんとう","出征","しゅっせい","焦燥","しょうそう","沢ガニ","さわがに","端書き","はしがき","跳ねる","はねる","指摘","してき","奴隷","どれい","浸透","しんとう","胴衣","どうい","濃い","こい","爆発","ばくはつ","模範","もはん","接尾語","せつびご","浮き足","うきあし","横幅","よこはば","抱える","かかえる","帽子","ぼうし","矛盾","むじゅん","黙る","だまる","腰抜け","しぬけ　","欄干","らんかん","涙を呑む","なみだをのむ","失恋","しつれん"]
[null,null,null,null,null,null,null,null,null,"〔066〕　　奥底　　⇔　　おくそこ",null,null,{"$f":"LEN($J16)","v":18},{"$f":"FIND(\"〕\",J16)","v":5},{"$f":"FIND(O$5,$J16)","v":12},{"$f":"RIGHT(LEFT($J16,$O16-3),LEN(LEFT($J16,$O16-3))-7)","v":"奥底"},{"$f":"RIGHT(J16,(LEN(J16)-FIND(O$5,$J16)-2))","v":"おくそこ"},11,"依存","いぞん","北緯","ほくい","年越し","としこし","奥底","おくそこ","警戒","けいかい","乾電池","かんでんち","含める","ふくめる","遊戯",{"$f":"AH17","v":"ゆうぎ"},{"$f":"AI17","v":"巨万"},{"$f":"AJ17","v":"きょまん"},{"$f":"AK17","v":"不況"},{"$f":"AL17","v":"ふきょう"},{"$f":"AM17","v":"屈伸"},{"$f":"AN17","v":"くっしん"},{"$f":"AO17","v":"撃退"},{"$f":"AP17","v":"げきたい"},{"$f":"AQ17","v":"手堅い"},{"$f":"AR17","v":"てがたい"},{"$f":"AS17","v":"対抗"},{"$f":"AT17","v":"たいこう"},{"$f":"AU17","v":"原稿"},{"$f":"AV17","v":"げんこう"},{"$f":"AW17","v":"記載"},{"$f":"AX17","v":"きさい"},{"$f":"AY17","v":"油脂"},{"$f":"AZ17","v":"ゆし"},"注釈","ちゅうしゃく","舟歌","ふなうた","一巡","いちじゅん","丈夫","じょうぶ","振れる","ふれる","陣痛","じんつう","追跡","ついせき","騒音","そうおん","拓本","たくほん","道端","みちばた","跳ぶ","とぶ","摘み草","つみくさ","農奴","のうど","透明","とうめい","胴上げ","どうあげ","祝杯","しゅくはい","爆笑","ばくしょう","師範","しはん","尾を振る","おをふる","普通","ふつう","払底","ふってい","高峰","こうほう","脱帽","だつぼう","矛先","ほこさき","家紋","かもん","本腰","ほんごし","欄外","らんがい","隷書","れいしょ","初恋","はつこい"]
[null,null,null,null,null,null,null,null,null,null,null,null,null,null,null,{"$f":"P16","v":"奥底"},{"$f":"Q16","v":"おくそこ"},12,"依存",{"$f":"T16","v":"いぞん"},"北緯",{"$f":"V16","v":"ほくい"},"年越し",{"$f":"X16","v":"としこし"},"奥底","おくそこ","警戒",{"$f":"AB16","v":"けいかい"},"乾電池",{"$f":"AD16","v":"かんでんち"},"含める",{"$f":"AF16","v":"ふくめる"},"遊戯","ゆうぎ","巨万","きょまん","不況","ふきょう","屈伸","くっしん","撃退","げきたい","手堅い","てがたい","対抗","たいこう","原稿","げんこう","記載","きさい","油脂","ゆし","注釈","ちゅうしゃく","舟歌","ふなうた","一巡","いちじゅん","丈夫","じょうぶ","振れる","ふれる","陣痛","じんつう","追跡","ついせき","騒音","そうおん","拓本","たくほん","道端","みちばた","跳ぶ","とぶ","摘み草","つみくさ","農奴","のうど","透明","とうめい","胴上げ","どうあげ","祝杯","しゅくはい","爆笑","ばくしょう","師範","しはん","尾を振る","おをふる","普通","ふつう","払底","ふってい","高峰","こうほう","脱帽","だつぼう","矛先","ほこさき","家紋","かもん","本腰","ほんごし","欄外","らんがい","隷書","れいしょ","初恋","はつこい"]
[null,null,null,null,null,null,null,null,null,"〔067〕　　奥様　　⇔　　おくさま",null,null,{"$f":"LEN($J18)","v":18},{"$f":"FIND(\"〕\",J18)","v":5},{"$f":"FIND(O$5,$J18)","v":12},{"$f":"RIGHT(LEFT($J18,$O18-3),LEN(LEFT($J18,$O18-3))-7)","v":"奥様"},{"$f":"RIGHT(J18,(LEN(J18)-FIND(O$5,$J18)-2))","v":"おくさま"},13,"依然","いぜん","緯度","いど","援助","えんじょ","奥様","おくさま","戒告","かいこく","乾期","かんき","奇跡","きせき","詰まる",{"$f":"AH19","v":"つまる"},{"$f":"AI19","v":"巨人"},{"$f":"AJ19","v":"きょじん"},{"$f":"AK19","v":"狭い"},{"$f":"AL19","v":"せまい"},{"$f":"AM19","v":"不屈"},{"$f":"AN19","v":"ふくつ"},{"$f":"AO19","v":"攻撃"},{"$f":"AP19","v":"こうげき"},{"$f":"AQ19","v":"派遣"},{"$f":"AR19","v":"はけん"},{"$f":"AS19","v":"攻守"},{"$f":"AT19","v":"こうしゅ"},{"$f":"AU19","v":"投稿"},{"$f":"AV19","v":"とうこう"},{"$f":"AW19","v":"載る"},{"$f":"AX19","v":"のる"},{"$f":"AY19","v":"脂"},{"$f":"AZ19","v":"あぶら"},"釈明","しゃくめい","秀才","しゅうさい","島巡り","しまめぐり","気丈","きじょう","浸水","しんすい","円陣","えんじん","遺跡","いせき","物騒","ぶっそう","開拓","かいたく","弾力","だんりょく","徴収","ちょうしゅう","水滴","すいてき","守銭奴","しゅせんど","透ける","すける","峠","とうげ","一杯","いっぱい","散髪","さんぱつ","繁栄","はんえい","微笑","びしょう","普及","ふきゅう","支払う","しはらう","連峰","れんぽう","制帽","せいぼう","矛","ほこ","指紋","しもん","舞踊団","ぶようだん","空欄","くうらん","隷属","れいぞく","露出","ろしゅつ"]
[null,null,null,null,null,null,null,null,null,null,null,null,null,null,null,{"$f":"P18","v":"奥様"},{"$f":"Q18","v":"おくさま"},14,"依然",{"$f":"T18","v":"いぜん"},"緯度",{"$f":"V18","v":"いど"},"援助",{"$f":"X18","v":"えんじょ"},"奥様","おくさま","戒告",{"$f":"AB18","v":"かいこく"},"乾期",{"$f":"AD18","v":"かんき"},"奇跡",{"$f":"AF18","v":"きせき"},"詰まる","つまる","巨人","きょじん","狭い","せまい","不屈","ふくつ","攻撃","こうげき","派遣","はけん","攻守","こうしゅ","投稿","とうこう","載る","のる","脂","あぶら","釈明","しゃくめい","秀才","しゅうさい","島巡り","しまめぐり","気丈","きじょう","浸水","しんすい","円陣","えんじん","遺跡","いせき","物騒","ぶっそう","開拓","かいたく","弾力","だんりょく","徴収","ちょうしゅう","水滴","すいてき","守銭奴","しゅせんど","透ける","すける","峠","とうげ","一杯","いっぱい","散髪","さんぱつ","繁栄","はんえい","微笑","びしょう","普及","ふきゅう","支払う","しはらう","連峰","れんぽう","制帽","せいぼう","矛","ほこ","指紋","しもん","舞踊団","ぶようだん","空欄","くうらん","隷属","れいぞく","露出","ろしゅつ"]
[null,null,null,null,null,null,null,null,null,"〔068〕　　記憶　　⇔　　きおく",null,null,{"$f":"LEN($J20)","v":17},{"$f":"FIND(\"〕\",J20)","v":5},{"$f":"FIND(O$5,$J20)","v":12},{"$f":"RIGHT(LEFT($J20,$O20-3),LEN(LEFT($J20,$O20-3))-7)","v":"記憶"},{"$f":"RIGHT(J20,(LEN(J20)-FIND(O$5,$J20)-2))","v":"きおく"},15,"依願","いがん","壱万","いちまん","応援","おうえん","記憶","きおく","皆無","かいむ","乾く","かわく","奇数","きすう","詰める",{"$f":"AH21","v":"つめる"},{"$f":"AI21","v":"拠点"},{"$f":"AJ21","v":"きょてん"},{"$f":"AK21","v":"手狭"},{"$f":"AL21","v":"てぜま"},{"$f":"AM21","v":"採掘"},{"$f":"AN21","v":"さいくつ"},{"$f":"AO21","v":"早撃ち"},{"$f":"AP21","v":"はやうち"},{"$f":"AQ21","v":"小遣い"},{"$f":"AR21","v":"こづかい"},{"$f":"AS21","v":"速攻"},{"$f":"AT21","v":"そっこう"},{"$f":"AU21","v":"豪華"},{"$f":"AV21","v":"ごうか"},{"$f":"AW21","v":"載せる"},{"$f":"AX21","v":"のせる"},{"$f":"AY21","v":"紫煙"},{"$f":"AZ21","v":"しえん"},"釈放","しゃくほう","優秀","ゆうしゅう","矛盾","むじゅん","丈","たけ","浸透","しんとう","尋問","じんもん","跡目","あとめ","騒ぐ","さわぐ","干拓","かんたく","弾く","ひく","特徴","とくちょう","点滴","てんてき","怒号","どごう","透かす","すかす","峠道","とうげみち","杯","さかずき","頭髪","とうはつ","農繁期","のうはんき","微量","びりょう","普段","ふだん","払う","はらう","山の峰","やまのみね","凡人","ぼんじん","濃霧","のうむ","波紋","はもん","盆踊り","ぼんおどり","距離","きょり","奴隷","どれい","披露","ひろう"]
{"$rows_left_out":25}