{"text_format":"1","workbook":"xlsx","n_sheets":4,"sheets":["部首と位置","部首名わかるかな","部首名一覧","部首の位置のもと"],"not_rendered":{"charts":0,"images":0,"macros":0,"external_links":0,"defined_names":0,"comments":0,"pivot_tables":0},"unopened":[],"bounds":{"document_bytes":16777216,"sheet_cells":100000,"rows_first":2000,"rows_last":500,"rows_between":2000,"halvings":0,"cell_chars":16384,"cell_head_chars":4096},"cells_cut":0,"cells_raw":0,"read":"whole","date_system":"1900"}

{"sheet":"部首と位置","index":0,"n_rows":9,"n_cols":11,"rows_kept":9,"cut":false,"hidden":false,"merged":[[1,2,8,2]]}
[0]
[null,null,{"$f":"VLOOKUP($A$1,部首の位置のもと!$B$3:$C$10,2)","v":"部首の呼び名"},{"$f":"IF(IF($A$1=1,部首の位置のもと!G4,IF($A$1=2,部首の位置のもと!G13,IF(部首と位置!$A$1=3,部首の位置のもと!G22,IF($A$1=4,部首の位置のもと!G31,IF(部首と位置!$A$1=5,部首の位置のもと!G40,IF($A$1=6,部首の位置のもと!G49,IF($A$1=7,部首の位置のもと!G58,IF($A$1=8,部首の位置のもと!G67,\"\"))))))))=\"\",\"\",IF($A$1=1,部首の位置のもと!G4,IF($A$1=2,部首の位置のもと!G13,IF(部首と位置!$A$1=3,部首の位置のもと!G22,IF($A$1=4,部首の位置のもと!G31,IF(部首と位置!$A$1=5,部首の位置のもと!G40,IF($A$1=6,部首の位置のもと!G49,IF($A$1=7,部首の位置のもと!G58,IF($A$1=8,部首の位置のもと!G67,\"\")))))))))","v":""},{"$f":"IF(IF($A$1=1,部首の位置のもと!H4,IF($A$1=2,部首の位置のもと!H13,IF(部首と位置!$A$1=3,部首の位置のもと!H22,IF($A$1=4,部首の位置のもと!H31,IF(部首と位置!$A$1=5,部首の位置のもと!H40,IF($A$1=6,部首の位置のもと!H49,IF($A$1=7,部首の位置のもと!H58,IF($A$1=8,部首の位置のもと!H67,\"\"))))))))=\"\",\"\",IF($A$1=1,部首の位置のもと!H4,IF($A$1=2,部首の位置のもと!H13,IF(部首と位置!$A$1=3,部首の位置のもと!H22,IF($A$1=4,部首の位置のもと!H31,IF(部首と位置!$A$1=5,部首の位置のもと!H40,IF($A$1=6,部首の位置のもと!H49,IF($A$1=7,部首の位置のもと!H58,IF($A$1=8,部首の位置のもと!H67,\"\")))))))))","v":""},{"$f":"IF(IF($A$1=1,部首の位置のもと!I4,IF($A$1=2,部首の位置のもと!I13,IF(部首と位置!$A$1=3,部首の位置のもと!I22,IF($A$1=4,部首の位置のもと!I31,IF(部首と位置!$A$1=5,部首の位置のもと!I40,IF($A$1=6,部首の位置のもと!I49,IF($A$1=7,部首の位置のもと!I58,IF($A$1=8,部首の位置のもと!I67,\"\"))))))))=\"\",\"\",IF($A$1=1,部首の位置のもと!I4,IF($A$1=2,部首の位置のもと!I13,IF(部首と位置!$A$1=3,部首の位置のもと!I22,IF($A$1=4,部首の位置のもと!I31,IF(部首と位置!$A$1=5,部首の位置のもと!I40,IF($A$1=6,部首の位置のもと!I49,IF($A$1=7,部首の位置のもと!I58,IF($A$1=8,部首の位置のもと!I67,\"\")))))))))","v":""},{"$f":"IF(IF($A$1=1,部首の位置のもと!J4,IF($A$1=2,部首の位置のもと!J13,IF(部首と位置!$A$1=3,部首の位置のもと!J22,IF($A$1=4,部首の位置のもと!J31,IF(部首と位置!$A$1=5,部首の位置のもと!J40,IF($A$1=6,部首の位置のもと!J49,IF($A$1=7,部首の位置のもと!J58,IF($A$1=8,部首の位置のもと!J67,\"\"))))))))=\"\",\"\",IF($A$1=1,部首の位置のもと!J4,IF($A$1=2,部首の位置のもと!J13,IF(部首と位置!$A$1=3,部首の位置のもと!J22,IF($A$1=4,部首の位置のもと!J31,IF(部首と位置!$A$1=5,部首の位置のもと!J40,IF($A$1=6,部首の位置のもと!J49,IF($A$1=7,部首の位置のもと!J58,IF($A$1=8,部首の位置のもと!J67,\"\")))))))))","v":""},{"$f":"IF(IF($A$1=1,部首の位置のもと!K4,IF($A$1=2,部首の位置のもと!K13,IF(部首と位置!$A$1=3,部首の位置のもと!K22,IF($A$1=4,部首の位置のもと!K31,IF(部首と位置!$A$1=5,部首の位置のもと!K40,IF($A$1=6,部首の位置のもと!K49,IF($A$1=7,部首の位置のもと!K58,IF($A$1=8,部首の位置のもと!K67,\"\"))))))))=\"\",\"\",IF($A$1=1,部首の位置のもと!K4,IF($A$1=2,部首の位置のもと!K13,IF(部首と位置!$A$1=3,部首の位置のもと!K22,IF($A$1=4,部首の位置のもと!K31,IF(部首と位置!$A$1=5,部首の位置のもと!K40,IF($A$1=6,部首の位置のもと!K49,IF($A$1=7,部首の位置のもと!K58,IF($A$1=8,部首の位置のもと!K67,\"\")))))))))","v":""},{"$f":"IF(IF($A$1=1,部首の位置のもと!L4,IF($A$1=2,部首の位置のもと!L13,IF(部首と位置!$A$1=3,部首の位置のもと!L22,IF($A$1=4,部首の位置のもと!L31,IF(部首と位置!$A$1=5,部首の位置のもと!L40,IF($A$1=6,部首の位置のもと!L49,IF($A$1=7,部首の位置のもと!L58,IF($A$1=8,部首の位置のもと!L67,\"\"))))))))=\"\",\"\",IF($A$1=1,部首の位置のもと!L4,IF($A$1=2,部首の位置のもと!L13,IF(部首と位置!$A$1=3,部首の位置のもと!L22,IF($A$1=4,部首の位置のもと!L31,IF(部首と位置!$A$1=5,部首の位置のもと!L40,IF($A$1=6,部首の位置のもと!L49,IF($A$1=7,部首の位置のもと!L58,IF($A$1=8,部首の位置のもと!L67,\"\")))))))))","v":""},{"$f":"IF(IF($A$1=1,部首の位置のもと!M4,IF($A$1=2,部首の位置のもと!M13,IF(部首と位置!$A$1=3,部首の位置のもと!M22,IF($A$1=4,部首の位置のもと!M31,IF(部首と位置!$A$1=5,部首の位置のもと!M40,IF($A$1=6,部首の位置のもと!M49,IF($A$1=7,部首の位置のもと!M58,IF($A$1=8,部首の位置のもと!M67,\"\"))))))))=\"\",\"\",IF($A$1=1,部首の位置のもと!M4,IF($A$1=2,部首の位置のもと!M13,IF(部首と位置!$A$1=3,部首の位置のもと!M22,IF($A$1=4,部首の位置のもと!M31,IF(部首と位置!$A$1=5,部首の位置のもと!M40,IF($A$1=6,部首の位置のもと!M49,IF($A$1=7,部首の位置のもと!M58,IF($A$1=8,部首の位置のもと!M67,\"\")))))))))","v":""},{"$f":"IF(IF($A$1=1,部首の位置のもと!N4,IF($A$1=2,部首の位置のもと!N13,IF(部首と位置!$A$1=3,部首の位置のもと!N22,IF($A$1=4,部首の位置のもと!N31,IF(部首と位置!$A$1=5,部首の位置のもと!N40,IF($A$1=6,部首の位置のもと!N49,IF($A$1=7,部首の位置のもと!N58,IF($A$1=8,部首の位置のもと!N67,\"\"))))))))=\"\",\"\",IF($A$1=1,部首の位置のもと!N4,IF($A$1=2,部首の位置のもと!N13,IF(部首と位置!$A$1=3,部首の位置のもと!N22,IF($A$1=4,部首の位置のもと!N31,IF(部首と位置!$A$1=5,部首の位置のもと!N40,IF($A$1=6,部首の位置のもと!N49,IF($A$1=7,部首の位置のもと!N58,IF($A$1=8,部首の位置のもと!N67,\"\")))))))))","v":""}]
[null,null,null,{"$f":"IF(IF($A$1=1,部首の位置のもと!G5,IF($A$1=2,部首の位置のもと!G14,IF(部首と位置!$A$1=3,部首の位置のもと!G23,IF($A$1=4,部首の位置のもと!G32,IF(部首と位置!$A$1=5,部首の位置のもと!G41,IF($A$1=6,部首の位置のもと!G50,IF($A$1=7,部首の位置のもと!G59,IF($A$1=8,部首の位置のもと!G68,\"\"))))))))=\"\",\"\",IF($A$1=1,部首の位置のもと!G5,IF($A$1=2,部首の位置のもと!G14,IF(部首と位置!$A$1=3,部首の位置のもと!G23,IF($A$1=4,部首の位置のもと!G32,IF(部首と位置!$A$1=5,部首の位置のもと!G41,IF($A$1=6,部首の位置のもと!G50,IF($A$1=7,部首の位置のもと!G59,IF($A$1=8,部首の位置のもと!G68,\"\")))))))))","v":""},{"$f":"IF(IF($A$1=1,部首の位置のもと!H5,IF($A$1=2,部首の位置のもと!H14,IF(部首と位置!$A$1=3,部首の位置のもと!H23,IF($A$1=4,部首の位置のもと!H32,IF(部首と位置!$A$1=5,部首の位置のもと!H41,IF($A$1=6,部首の位置のもと!H50,IF($A$1=7,部首の位置のもと!H59,IF($A$1=8,部首の位置のもと!H68,\"\"))))))))=\"\",\"\",IF($A$1=1,部首の位置のもと!H5,IF($A$1=2,部首の位置のもと!H14,IF(部首と位置!$A$1=3,部首の位置のもと!H23,IF($A$1=4,部首の位置のもと!H32,IF(部首と位置!$A$1=5,部首の位置のもと!H41,IF($A$1=6,部首の位置のもと!H50,IF($A$1=7,部首の位置のもと!H59,IF($A$1=8,部首の位置のもと!H68,\"\")))))))))","v":""},{"$f":"IF(IF($A$1=1,部首の位置のもと!I5,IF($A$1=2,部首の位置のもと!I14,IF(部首と位置!$A$1=3,部首の位置のもと!I23,IF($A$1=4,部首の位置のもと!I32,IF(部首と位置!$A$1=5,部首の位置のもと!I41,IF($A$1=6,部首の位置のもと!I50,IF($A$1=7,部首の位置のもと!I59,IF($A$1=8,部首の位置のもと!I68,\"\"))))))))=\"\",\"\",IF($A$1=1,部首の位置のもと!I5,IF($A$1=2,部首の位置のもと!I14,IF(部首と位置!$A$1=3,部首の位置のもと!I23,IF($A$1=4,部首の位置のもと!I32,IF(部首と位置!$A$1=5,部首の位置のもと!I41,IF($A$1=6,部首の位置のもと!I50,IF($A$1=7,部首の位置のもと!I59,IF($A$1=8,部首の位置のもと!I68,\"\")))))))))","v":""},{"$f":"IF(IF($A$1=1,部首の位置のもと!J5,IF($A$1=2,部首の位置のもと!J14,IF(部首と位置!$A$1=3,部首の位置のもと!J23,IF($A$1=4,部首の位置のもと!J32,IF(部首と位置!$A$1=5,部首の位置のもと!J41,IF($A$1=6,部首の位置のもと!J50,IF($A$1=7,部首の位置のもと!J59,IF($A$1=8,部首の位置のもと!J68,\"\"))))))))=\"\",\"\",IF($A$1=1,部首の位置のもと!J5,IF($A$1=2,部首の位置のもと!J14,IF(部首と位置!$A$1=3,部首の位置のもと!J23,IF($A$1=4,部首の位置のもと!J32,IF(部首と位置!$A$1=5,部首の位置のもと!J41,IF($A$1=6,部首の位置のもと!J50,IF($A$1=7,部首の位置のもと!J59,IF($A$1=8,部首の位置のもと!J68,\"\")))))))))","v":""},{"$f":"IF(IF($A$1=1,部首の位置のもと!K5,IF($A$1=2,部首の位置のもと!K14,IF(部首と位置!$A$1=3,部首の位置のもと!K23,IF($A$1=4,部首の位置のもと!K32,IF(部首と位置!$A$1=5,部首の位置のもと!K41,IF($A$1=6,部首の位置のもと!K50,IF($A$1=7,部首の位置のもと!K59,IF($A$1=8,部首の位置のもと!K68,\"\"))))))))=\"\",\"\",IF($A$1=1,部首の位置のもと!K5,IF($A$1=2,部首の位置のもと!K14,IF(部首と位置!$A$1=3,部首の位置のもと!K23,IF($A$1=4,部首の位置のもと!K32,IF(部首と位置!$A$1=5,部首の位置のもと!K41,IF($A$1=6,部首の位置のもと!K50,IF($A$1=7,部首の位置のもと!K59,IF($A$1=8,部首の位置のもと!K68,\"\")))))))))","v":""},{"$f":"IF(IF($A$1=1,部首の位置のもと!L5,IF($A$1=2,部首の位置のもと!L14,IF(部首と位置!$A$1=3,部首の位置のもと!L23,IF($A$1=4,部首の位置のもと!L32,IF(部首と位置!$A$1=5,部首の位置のもと!L41,IF($A$1=6,部首の位置のもと!L50,IF($A$1=7,部首の位置のもと!L59,IF($A$1=8,部首の位置のもと!L68,\"\"))))))))=\"\",\"\",IF($A$1=1,部首の位置のもと!L5,IF($A$1=2,部首の位置のもと!L14,IF(部首と位置!$A$1=3,部首の位置のもと!L23,IF($A$1=4,部首の位置のもと!L32,IF(部首と位置!$A$1=5,部首の位置のもと!L41,IF($A$1=6,部首の位置のもと!L50,IF($A$1=7,部首の位置のもと!L59,IF($A$1=8,部首の位置のもと!L68,\"\")))))))))","v":""},{"$f":"IF(IF($A$1=1,部首の位置のもと!M5,IF($A$1=2,部首の位置のもと!M14,IF(部首と位置!$A$1=3,部首の位置のもと!M23,IF($A$1=4,部首の位置のもと!M32,IF(部首と位置!$A$1=5,部首の位置のもと!M41,IF($A$1=6,部首の位置のもと!M50,IF($A$1=7,部首の位置のもと!M59,IF($A$1=8,部首の位置のもと!M68,\"\"))))))))=\"\",\"\",IF($A$1=1,部首の位置のもと!M5,IF($A$1=2,部首の位置のもと!M14,IF(部首と位置!$A$1=3,部首の位置のもと!M23,IF($A$1=4,部首の位置のもと!M32,IF(部首と位置!$A$1=5,部首の位置のもと!M41,IF($A$1=6,部首の位置のもと!M50,IF($A$1=7,部首の位置のもと!M59,IF($A$1=8,部首の位置のもと!M68,\"\")))))))))","v":""},{"$f":"IF(IF($A$1=1,部首の位置のもと!N5,IF($A$1=2,部首の位置のもと!N14,IF(部首と位置!$A$1=3,部首の位置のもと!N23,IF($A$1=4,部首の位置のもと!N32,IF(部首と位置!$A$1=5,部首の位置のもと!N41,IF($A$1=6,部首の位置のもと!N50,IF($A$1=7,部首の位置のもと!N59,IF($A$1=8,部首の位置のもと!N68,\"\"))))))))=\"\",\"\",IF($A$1=1,部首の位置のもと!N5,IF($A$1=2,部首の位置のもと!N14,IF(部首と位置!$A$1=3,部首の位置のもと!N23,IF($A$1=4,部首の位置のもと!N32,IF(部首と位置!$A$1=5,部首の位置のもと!N41,IF($A$1=6,部首の位置のもと!N50,IF($A$1=7,部首の位置のもと!N59,IF($A$1=8,部首の位置のもと!N68,\"\")))))))))","v":""}]
[null,null,null,{"$f":"IF(IF($A$1=1,部首の位置のもと!G6,IF($A$1=2,部首の位置のもと!G15,IF(部首と位置!$A$1=3,部首の位置のもと!G24,IF($A$1=4,部首の位置のもと!G33,IF(部首と位置!$A$1=5,部首の位置のもと!G42,IF($A$1=6,部首の位置のもと!G51,IF($A$1=7,部首の位置のもと!G60,IF($A$1=8,部首の位置のもと!G69,\"\"))))))))=\"\",\"\",IF($A$1=1,部首の位置のもと!G6,IF($A$1=2,部首の位置のもと!G15,IF(部首と位置!$A$1=3,部首の位置のもと!G24,IF($A$1=4,部首の位置のもと!G33,IF(部首と位置!$A$1=5,部首の位置のもと!G42,IF($A$1=6,部首の位置のもと!G51,IF($A$1=7,部首の位置のもと!G60,IF($A$1=8,部首の位置のもと!G69,\"\")))))))))","v":""},{"$f":"IF(IF($A$1=1,部首の位置のもと!H6,IF($A$1=2,部首の位置のもと!H15,IF(部首と位置!$A$1=3,部首の位置のもと!H24,IF($A$1=4,部首の位置のもと!H33,IF(部首と位置!$A$1=5,部首の位置のもと!H42,IF($A$1=6,部首の位置のもと!H51,IF($A$1=7,部首の位置のもと!H60,IF($A$1=8,部首の位置のもと!H69,\"\"))))))))=\"\",\"\",IF($A$1=1,部首の位置のもと!H6,IF($A$1=2,部首の位置のもと!H15,IF(部首と位置!$A$1=3,部首の位置のもと!H24,IF($A$1=4,部首の位置のもと!H33,IF(部首と位置!$A$1=5,部首の位置のもと!H42,IF($A$1=6,部首の位置のもと!H51,IF($A$1=7,部首の位置のもと!H60,IF($A$1=8,部首の位置のもと!H69,\"\")))))))))","v":""},{"$f":"IF(IF($A$1=1,部首の位置のもと!I6,IF($A$1=2,部首の位置のもと!I15,IF(部首と位置!$A$1=3,部首の位置のもと!I24,IF($A$1=4,部首の位置のもと!I33,IF(部首と位置!$A$1=5,部首の位置のもと!I42,IF($A$1=6,部首の位置のもと!I51,IF($A$1=7,部首の位置のもと!I60,IF($A$1=8,部首の位置のもと!I69,\"\"))))))))=\"\",\"\",IF($A$1=1,部首の位置のもと!I6,IF($A$1=2,部首の位置のもと!I15,IF(部首と位置!$A$1=3,部首の位置のもと!I24,IF($A$1=4,部首の位置のもと!I33,IF(部首と位置!$A$1=5,部首の位置のもと!I42,IF($A$1=6,部首の位置のもと!I51,IF($A$1=7,部首の位置のもと!I60,IF($A$1=8,部首の位置のもと!I69,\"\")))))))))","v":""},{"$f":"IF(IF($A$1=1,部首の位置のもと!J6,IF($A$1=2,部首の位置のもと!J15,IF(部首と位置!$A$1=3,部首の位置のもと!J24,IF($A$1=4,部首の位置のもと!J33,IF(部首と位置!$A$1=5,部首の位置のもと!J42,IF($A$1=6,部首の位置のもと!J51,IF($A$1=7,部首の位置のもと!J60,IF($A$1=8,部首の位置のもと!J69,\"\"))))))))=\"\",\"\",IF($A$1=1,部首の位置のもと!J6,IF($A$1=2,部首の位置のもと!J15,IF(部首と位置!$A$1=3,部首の位置のもと!J24,IF($A$1=4,部首の位置のもと!J33,IF(部首と位置!$A$1=5,部首の位置のもと!J42,IF($A$1=6,部首の位置のもと!J51,IF($A$1=7,部首の位置のもと!J60,IF($A$1=8,部首の位置のもと!J69,\"\")))))))))","v":""},{"$f":"IF(IF($A$1=1,部首の位置のもと!K6,IF($A$1=2,部首の位置のもと!K15,IF(部首と位置!$A$1=3,部首の位置のもと!K24,IF($A$1=4,部首の位置のもと!K33,IF(部首と位置!$A$1=5,部首の位置のもと!K42,IF($A$1=6,部首の位置のもと!K51,IF($A$1=7,部首の位置のもと!K60,IF($A$1=8,部首の位置のもと!K69,\"\"))))))))=\"\",\"\",IF($A$1=1,部首の位置のもと!K6,IF($A$1=2,部首の位置のもと!K15,IF(部首と位置!$A$1=3,部首の位置のもと!K24,IF($A$1=4,部首の位置のもと!K33,IF(部首と位置!$A$1=5,部首の位置のもと!K42,IF($A$1=6,部首の位置のもと!K51,IF($A$1=7,部首の位置のもと!K60,IF($A$1=8,部首の位置のもと!K69,\"\")))))))))","v":""},{"$f":"IF(IF($A$1=1,部首の位置のもと!L6,IF($A$1=2,部首の位置のもと!L15,IF(部首と位置!$A$1=3,部首の位置のもと!L24,IF($A$1=4,部首の位置のもと!L33,IF(部首と位置!$A$1=5,部首の位置のもと!L42,IF($A$1=6,部首の位置のもと!L51,IF($A$1=7,部首の位置のもと!L60,IF($A$1=8,部首の位置のもと!L69,\"\"))))))))=\"\",\"\",IF($A$1=1,部首の位置のもと!L6,IF($A$1=2,部首の位置のもと!L15,IF(部首と位置!$A$1=3,部首の位置のもと!L24,IF($A$1=4,部首の位置のもと!L33,IF(部首と位置!$A$1=5,部首の位置のもと!L42,IF($A$1=6,部首の位置のもと!L51,IF($A$1=7,部首の位置のもと!L60,IF($A$1=8,部首の位置のもと!L69,\"\")))))))))","v":""},{"$f":"IF(IF($A$1=1,部首の位置のもと!M6,IF($A$1=2,部首の位置のもと!M15,IF(部首と位置!$A$1=3,部首の位置のもと!M24,IF($A$1=4,部首の位置のもと!M33,IF(部首と位置!$A$1=5,部首の位置のもと!M42,IF($A$1=6,部首の位置のもと!M51,IF($A$1=7,部首の位置のもと!M60,IF($A$1=8,部首の位置のもと!M69,\"\"))))))))=\"\",\"\",IF($A$1=1,部首の位置のもと!M6,IF($A$1=2,部首の位置のもと!M15,IF(部首と位置!$A$1=3,部首の位置のもと!M24,IF($A$1=4,部首の位置のもと!M33,IF(部首と位置!$A$1=5,部首の位置のもと!M42,IF($A$1=6,部首の位置のもと!M51,IF($A$1=7,部首の位置のもと!M60,IF($A$1=8,部首の位置のもと!M69,\"\")))))))))","v":""},{"$f":"IF(IF($A$1=1,部首の位置のもと!N6,IF($A$1=2,部首の位置のもと!N15,IF(部首と位置!$A$1=3,部首の位置のもと!N24,IF($A$1=4,部首の位置のもと!N33,IF(部首と位置!$A$1=5,部首の位置のもと!N42,IF($A$1=6,部首の位置のもと!N51,IF($A$1=7,部首の位置のもと!N60,IF($A$1=8,部首の位置のもと!N69,\"\"))))))))=\"\",\"\",IF($A$1=1,部首の位置のもと!N6,IF($A$1=2,部首の位置のもと!N15,IF(部首と位置!$A$1=3,部首の位置のもと!N24,IF($A$1=4,部首の位置のもと!N33,IF(部首と位置!$A$1=5,部首の位置のもと!N42,IF($A$1=6,部首の位置のもと!N51,IF($A$1=7,部首の位置のもと!N60,IF($A$1=8,部首の位置のもと!N69,\"\")))))))))","v":""}]
[null,null,null,{"$f":"IF(IF($A$1=1,部首の位置のもと!G7,IF($A$1=2,部首の位置のもと!G16,IF(部首と位置!$A$1=3,部首の位置のもと!G25,IF($A$1=4,部首の位置のもと!G34,IF(部首と位置!$A$1=5,部首の位置のもと!G43,IF($A$1=6,部首の位置のもと!G52,IF($A$1=7,部首の位置のもと!G61,IF($A$1=8,部首の位置のもと!G70,\"\"))))))))=\"\",\"\",IF($A$1=1,部首の位置のもと!G7,IF($A$1=2,部首の位置のもと!G16,IF(部首と位置!$A$1=3,部首の位置のもと!G25,IF($A$1=4,部首の位置のもと!G34,IF(部首と位置!$A$1=5,部首の位置のもと!G43,IF($A$1=6,部首の位置のもと!G52,IF($A$1=7,部首の位置のもと!G61,IF($A$1=8,部首の位置のもと!G70,\"\")))))))))","v":""},{"$f":"IF(IF($A$1=1,部首の位置のもと!H7,IF($A$1=2,部首の位置のもと!H16,IF(部首と位置!$A$1=3,部首の位置のもと!H25,IF($A$1=4,部首の位置のもと!H34,IF(部首と位置!$A$1=5,部首の位置のもと!H43,IF($A$1=6,部首の位置のもと!H52,IF($A$1=7,部首の位置のもと!H61,IF($A$1=8,部首の位置のもと!H70,\"\"))))))))=\"\",\"\",IF($A$1=1,部首の位置のもと!H7,IF($A$1=2,部首の位置のもと!H16,IF(部首と位置!$A$1=3,部首の位置のもと!H25,IF($A$1=4,部首の位置のもと!H34,IF(部首と位置!$A$1=5,部首の位置のもと!H43,IF($A$1=6,部首の位置のもと!H52,IF($A$1=7,部首の位置のもと!H61,IF($A$1=8,部首の位置のもと!H70,\"\")))))))))","v":""},{"$f":"IF(IF($A$1=1,部首の位置のもと!I7,IF($A$1=2,部首の位置のもと!I16,IF(部首と位置!$A$1=3,部首の位置のもと!I25,IF($A$1=4,部首の位置のもと!I34,IF(部首と位置!$A$1=5,部首の位置のもと!I43,IF($A$1=6,部首の位置のもと!I52,IF($A$1=7,部首の位置のもと!I61,IF($A$1=8,部首の位置のもと!I70,\"\"))))))))=\"\",\"\",IF($A$1=1,部首の位置のもと!I7,IF($A$1=2,部首の位置のもと!I16,IF(部首と位置!$A$1=3,部首の位置のもと!I25,IF($A$1=4,部首の位置のもと!I34,IF(部首と位置!$A$1=5,部首の位置のもと!I43,IF($A$1=6,部首の位置のもと!I52,IF($A$1=7,部首の位置のもと!I61,IF($A$1=8,部首の位置のもと!I70,\"\")))))))))","v":""},{"$f":"IF(IF($A$1=1,部首の位置のもと!J7,IF($A$1=2,部首の位置のもと!J16,IF(部首と位置!$A$1=3,部首の位置のもと!J25,IF($A$1=4,部首の位置のもと!J34,IF(部首と位置!$A$1=5,部首の位置のもと!J43,IF($A$1=6,部首の位置のもと!J52,IF($A$1=7,部首の位置のもと!J61,IF($A$1=8,部首の位置のもと!J70,\"\"))))))))=\"\",\"\",IF($A$1=1,部首の位置のもと!J7,IF($A$1=2,部首の位置のもと!J16,IF(部首と位置!$A$1=3,部首の位置のもと!J25,IF($A$1=4,部首の位置のもと!J34,IF(部首と位置!$A$1=5,部首の位置のもと!J43,IF($A$1=6,部首の位置のもと!J52,IF($A$1=7,部首の位置のもと!J61,IF($A$1=8,部首の位置のもと!J70,\"\")))))))))","v":""},{"$f":"IF(IF($A$1=1,部首の位置のもと!K7,IF($A$1=2,部首の位置のもと!K16,IF(部首と位置!$A$1=3,部首の位置のもと!K25,IF($A$1=4,部首の位置のもと!K34,IF(部首と位置!$A$1=5,部首の位置のもと!K43,IF($A$1=6,部首の位置のもと!K52,IF($A$1=7,部首の位置のもと!K61,IF($A$1=8,部首の位置のもと!K70,\"\"))))))))=\"\",\"\",IF($A$1=1,部首の位置のもと!K7,IF($A$1=2,部首の位置のもと!K16,IF(部首と位置!$A$1=3,部首の位置のもと!K25,IF($A$1=4,部首の位置のもと!K34,IF(部首と位置!$A$1=5,部首の位置のもと!K43,IF($A$1=6,部首の位置のもと!K52,IF($A$1=7,部首の位置のもと!K61,IF($A$1=8,部首の位置のもと!K70,\"\")))))))))","v":""},{"$f":"IF(IF($A$1=1,部首の位置のもと!L7,IF($A$1=2,部首の位置のもと!L16,IF(部首と位置!$A$1=3,部首の位置のもと!L25,IF($A$1=4,部首の位置のもと!L34,IF(部首と位置!$A$1=5,部首の位置のもと!L43,IF($A$1=6,部首の位置のもと!L52,IF($A$1=7,部首の位置のもと!L61,IF($A$1=8,部首の位置のもと!L70,\"\"))))))))=\"\",\"\",IF($A$1=1,部首の位置のもと!L7,IF($A$1=2,部首の位置のもと!L16,IF(部首と位置!$A$1=3,部首の位置のもと!L25,IF($A$1=4,部首の位置のもと!L34,IF(部首と位置!$A$1=5,部首の位置のもと!L43,IF($A$1=6,部首の位置のもと!L52,IF($A$1=7,部首の位置のもと!L61,IF($A$1=8,部首の位置のもと!L70,\"\")))))))))","v":""},{"$f":"IF(IF($A$1=1,部首の位置のもと!M7,IF($A$1=2,部首の位置のもと!M16,IF(部首と位置!$A$1=3,部首の位置のもと!M25,IF($A$1=4,部首の位置のもと!M34,IF(部首と位置!$A$1=5,部首の位置のもと!M43,IF($A$1=6,部首の位置のもと!M52,IF($A$1=7,部首の位置のもと!M61,IF($A$1=8,部首の位置のもと!M70,\"\"))))))))=\"\",\"\",IF($A$1=1,部首の位置のもと!M7,IF($A$1=2,部首の位置のもと!M16,IF(部首と位置!$A$1=3,部首の位置のもと!M25,IF($A$1=4,部首の位置のもと!M34,IF(部首と位置!$A$1=5,部首の位置のもと!M43,IF($A$1=6,部首の位置のもと!M52,IF($A$1=7,部首の位置のもと!M61,IF($A$1=8,部首の位置のもと!M70,\"\")))))))))","v":""},{"$f":"IF(IF($A$1=1,部首の位置のもと!N7,IF($A$1=2,部首の位置のもと!N16,IF(部首と位置!$A$1=3,部首の位置のもと!N25,IF($A$1=4,部首の位置のもと!N34,IF(部首と位置!$A$1=5,部首の位置のもと!N43,IF($A$1=6,部首の位置のもと!N52,IF($A$1=7,部首の位置のもと!N61,IF($A$1=8,部首の位置のもと!N70,\"\"))))))))=\"\",\"\",IF($A$1=1,部首の位置のもと!N7,IF($A$1=2,部首の位置のもと!N16,IF(部首と位置!$A$1=3,部首の位置のもと!N25,IF($A$1=4,部首の位置のもと!N34,IF(部首と位置!$A$1=5,部首の位置のもと!N43,IF($A$1=6,部首の位置のもと!N52,IF($A$1=7,部首の位置のもと!N61,IF($A$1=8,部首の位置のもと!N70,\"\")))))))))","v":""}]
[null,null,null,{"$f":"IF(IF($A$1=1,部首の位置のもと!G8,IF($A$1=2,部首の位置のもと!G17,IF(部首と位置!$A$1=3,部首の位置のもと!G26,IF($A$1=4,部首の位置のもと!G35,IF(部首と位置!$A$1=5,部首の位置のもと!G44,IF($A$1=6,部首の位置のもと!G53,IF($A$1=7,部首の位置のもと!G62,IF($A$1=8,部首の位置のもと!G71,\"\"))))))))=\"\",\"\",IF($A$1=1,部首の位置のもと!G8,IF($A$1=2,部首の位置のもと!G17,IF(部首と位置!$A$1=3,部首の位置のもと!G26,IF($A$1=4,部首の位置のもと!G35,IF(部首と位置!$A$1=5,部首の位置のもと!G44,IF($A$1=6,部首の位置のもと!G53,IF($A$1=7,部首の位置のもと!G62,IF($A$1=8,部首の位置のもと!G71,\"\")))))))))","v":""},{"$f":"IF(IF($A$1=1,部首の位置のもと!H8,IF($A$1=2,部首の位置のもと!H17,IF(部首と位置!$A$1=3,部首の位置のもと!H26,IF($A$1=4,部首の位置のもと!H35,IF(部首と位置!$A$1=5,部首の位置のもと!H44,IF($A$1=6,部首の位置のもと!H53,IF($A$1=7,部首の位置のもと!H62,IF($A$1=8,部首の位置のもと!H71,\"\"))))))))=\"\",\"\",IF($A$1=1,部首の位置のもと!H8,IF($A$1=2,部首の位置のもと!H17,IF(部首と位置!$A$1=3,部首の位置のもと!H26,IF($A$1=4,部首の位置のもと!H35,IF(部首と位置!$A$1=5,部首の位置のもと!H44,IF($A$1=6,部首の位置のもと!H53,IF($A$1=7,部首の位置のもと!H62,IF($A$1=8,部首の位置のもと!H71,\"\")))))))))","v":""},{"$f":"IF(IF($A$1=1,部首の位置のもと!I8,IF($A$1=2,部首の位置のもと!I17,IF(部首と位置!$A$1=3,部首の位置のもと!I26,IF($A$1=4,部首の位置のもと!I35,IF(部首と位置!$A$1=5,部首の位置のもと!I44,IF($A$1=6,部首の位置のもと!I53,IF($A$1=7,部首の位置のもと!I62,IF($A$1=8,部首の位置のもと!I71,\"\"))))))))=\"\",\"\",IF($A$1=1,部首の位置のもと!I8,IF($A$1=2,部首の位置のもと!I17,IF(部首と位置!$A$1=3,部首の位置のもと!I26,IF($A$1=4,部首の位置のもと!I35,IF(部首と位置!$A$1=5,部首の位置のもと!I44,IF($A$1=6,部首の位置のもと!I53,IF($A$1=7,部首の位置のもと!I62,IF($A$1=8,部首の位置のもと!I71,\"\")))))))))","v":""},{"$f":"IF(IF($A$1=1,部首の位置のもと!J8,IF($A$1=2,部首の位置のもと!J17,IF(部首と位置!$A$1=3,部首の位置のもと!J26,IF($A$1=4,部首の位置のもと!J35,IF(部首と位置!$A$1=5,部首の位置のもと!J44,IF($A$1=6,部首の位置のもと!J53,IF($A$1=7,部首の位置のもと!J62,IF($A$1=8,部首の位置のもと!J71,\"\"))))))))=\"\",\"\",IF($A$1=1,部首の位置のもと!J8,IF($A$1=2,部首の位置のもと!J17,IF(部首と位置!$A$1=3,部首の位置のもと!J26,IF($A$1=4,部首の位置のもと!J35,IF(部首と位置!$A$1=5,部首の位置のもと!J44,IF($A$1=6,部首の位置のもと!J53,IF($A$1=7,部首の位置のもと!J62,IF($A$1=8,部首の位置のもと!J71,\"\")))))))))","v":""},{"$f":"IF(IF($A$1=1,部首の位置のもと!K8,IF($A$1=2,部首の位置のもと!K17,IF(部首と位置!$A$1=3,部首の位置のもと!K26,IF($A$1=4,部首の位置のもと!K35,IF(部首と位置!$A$1=5,部首の位置のもと!K44,IF($A$1=6,部首の位置のもと!K53,IF($A$1=7,部首の位置のもと!K62,IF($A$1=8,部首の位置のもと!K71,\"\"))))))))=\"\",\"\",IF($A$1=1,部首の位置のもと!K8,IF($A$1=2,部首の位置のもと!K17,IF(部首と位置!$A$1=3,部首の位置のもと!K26,IF($A$1=4,部首の位置のもと!K35,IF(部首と位置!$A$1=5,部首の位置のもと!K44,IF($A$1=6,部首の位置のもと!K53,IF($A$1=7,部首の位置のもと!K62,IF($A$1=8,部首の位置のもと!K71,\"\")))))))))","v":""},{"$f":"IF(IF($A$1=1,部首の位置のもと!L8,IF($A$1=2,部首の位置のもと!L17,IF(部首と位置!$A$1=3,部首の位置のもと!L26,IF($A$1=4,部首の位置のもと!L35,IF(部首と位置!$A$1=5,部首の位置のもと!L44,IF($A$1=6,部首の位置のもと!L53,IF($A$1=7,部首の位置のもと!L62,IF($A$1=8,部首の位置のもと!L71,\"\"))))))))=\"\",\"\",IF($A$1=1,部首の位置のもと!L8,IF($A$1=2,部首の位置のもと!L17,IF(部首と位置!$A$1=3,部首の位置のもと!L26,IF($A$1=4,部首の位置のもと!L35,IF(部首と位置!$A$1=5,部首の位置のもと!L44,IF($A$1=6,部首の位置のもと!L53,IF($A$1=7,部首の位置のもと!L62,IF($A$1=8,部首の位置のもと!L71,\"\")))))))))","v":""},{"$f":"IF(IF($A$1=1,部首の位置のもと!M8,IF($A$1=2,部首の位置のもと!M17,IF(部首と位置!$A$1=3,部首の位置のもと!M26,IF($A$1=4,部首の位置のもと!M35,IF(部首と位置!$A$1=5,部首の位置のもと!M44,IF($A$1=6,部首の位置のもと!M53,IF($A$1=7,部首の位置のもと!M62,IF($A$1=8,部首の位置のもと!M71,\"\"))))))))=\"\",\"\",IF($A$1=1,部首の位置のもと!M8,IF($A$1=2,部首の位置のもと!M17,IF(部首と位置!$A$1=3,部首の位置のもと!M26,IF($A$1=4,部首の位置のもと!M35,IF(部首と位置!$A$1=5,部首の位置のもと!M44,IF($A$1=6,部首の位置のもと!M53,IF($A$1=7,部首の位置のもと!M62,IF($A$1=8,部首の位置のもと!M71,\"\")))))))))","v":""},{"$f":"IF(IF($A$1=1,部首の位置のもと!N8,IF($A$1=2,部首の位置のもと!N17,IF(部首と位置!$A$1=3,部首の位置のもと!N26,IF($A$1=4,部首の位置のもと!N35,IF(部首と位置!$A$1=5,部首の位置のもと!N44,IF($A$1=6,部首の位置のもと!N53,IF($A$1=7,部首の位置のもと!N62,IF($A$1=8,部首の位置のもと!N71,\"\"))))))))=\"\",\"\",IF($A$1=1,部首の位置のもと!N8,IF($A$1=2,部首の位置のもと!N17,IF(部首と位置!$A$1=3,部首の位置のもと!N26,IF($A$1=4,部首の位置のもと!N35,IF(部首と位置!$A$1=5,部首の位置のもと!N44,IF($A$1=6,部首の位置のもと!N53,IF($A$1=7,部首の位置のもと!N62,IF($A$1=8,部首の位置のもと!N71,\"\")))))))))","v":""}]
{"$rows_left_out":4}
{"sheet":"部首名わかるかな","index":1,"n_rows":27,"n_cols":4,"rows_kept":27,"cut":false,"hidden":false,"merged":[[26,3,32,10],[1,3,25,10]]}
[1]
[{"$f":"VLOOKUP($A$1,部首名一覧!$C$3:$K$415,6)","v":"あお"},null,null,{"$f":"IF($A$2=\"首一覧\",VLOOKUP($A$1,部首名一覧!$C$3:$K$415,5)&\"行の部首\",VLOOKUP($A$1,部首名一覧!$C$3:$K$415,5))","v":"青"}]
[]
[]
[]
[]
{"$rows_left_out":22}
{"sheet":"部首名一覧","index":2,"n_rows":415,"n_cols":11,"rows_kept":415,"cut":false,"hidden":false,"merged":[]}
[]
[null,null,null,null,null,null,1]
[null,null,1,"青 - あお",{"$f":"LEN(D3)","v":6},null,{"$f":"LEFT($D3,G$2)","v":"青"},{"$f":"IFERROR(RIGHT($D3,(E3-4)),\"\")","v":"あお"},null,null,"青 - あお"]
[null,null,2,"赤 - あか",{"$f":"LEN(D4)","v":6},null,{"$f":"LEFT($D4,G$2)","v":"赤"},{"$f":"IFERROR(RIGHT($D4,(E4-4)),\"\")","v":"あか"},null,null,"赤 - あか"]
[null,null,3,"欠 - あくび",7,"a","欠","あくび",null,null,"欠 - あくび"]
[null,null,4,"麻 - あさ",6,null,"麻","あさ",null,null,"麻 - あさ"]
{"$rows_left_out":410}
{"sheet":"部首の位置のもと","index":3,"n_rows":74,"n_cols":14,"rows_kept":74,"cut":false,"hidden":false,"merged":[]}
[]
[]
[null,0,"部首の呼び名"]
[null,1,"へん",null,1,null,1,1,1,1]
[null,2,"つくり",null,null,null,1,1,1,1]
[null,3,"かんむり",null,null,null,1,1,1,1]
{"$rows_left_out":68}