{"text_format":"1","workbook":"xlsx","n_sheets":3,"sheets":["問題のシート","魚の元","訓読み一覧"],"not_rendered":{"charts":0,"images":1,"macros":0,"external_links":0,"defined_names":0,"comments":0,"pivot_tables":0},"unopened":[],"bounds":{"document_bytes":16777216,"sheet_cells":100000,"rows_first":2000,"rows_last":500,"rows_between":2000,"halvings":0,"cell_chars":16384,"cell_head_chars":4096},"cells_cut":0,"cells_raw":0,"read":"whole","date_system":"1900"}

{"sheet":"問題のシート","index":0,"n_rows":22,"n_cols":9,"rows_kept":22,"cut":false,"hidden":false,"merged":[[2,2,20,6],[0,1,1,8],[21,2,21,13],[7,8,17,10]]}
[null,"魚編の漢字たち"]
[]
[null,null,{"$f":"VLOOKUP(A6,魚の元!$B$5:$F$392,2)","v":"鮮"}]
[]
[]
[2]
[]
[null,null,null,null,null,null,null,null,{"$f":"VLOOKUP(A6,魚の元!$B$5:$F$392,4)","v":""}]
[]
[]
[]
[]
[]
[]
[]
[]
[]
[]
[]
[]
[]
[null,null,{"$f":"\"  \"&IF(VLOOKUP(A6,魚の元!$B$5:$F$392,3)=\"\",\"\",VLOOKUP(A6,魚の元!$B$5:$F$392,3))","v":"  あざ（やか）"}]

{"sheet":"魚の元","index":1,"n_rows":380,"n_cols":5,"rows_kept":380,"cut":false,"hidden":false,"merged":[[2,1,2,6]]}
[]
[]
[null,"魚偏の漢字（さかなへんのかんじ）"]
[]
[388,1,"鮮",null,{"$f":"LEFT(D6,1)","v":"あ"}]
[387,2,"鮮","あざ（やか）",{"$f":"LEFT(D7,1)","v":""}]
[386,3,"鯏",null,"あ"]
[385,4,"鯏","あさり",""]
[384,5,"鯵",null,"あ"]
[383,6,"鯵","あじ",""]
[382,7,"鰺",null,"あ"]
[381,8,"鰺","あじ",""]
[375,9,"鮎",null,"あ"]
[374,10,"鮎","あゆ",{"$f":"LEFT(D15,1)","v":""}]
[373,11,"鮑",null,{"$f":"LEFT(D16,1)","v":"あ"}]
[372,12,"鮑","あわび",""]
[371,13,"鰒",null,"あ"]
[370,14,"鰒","あわび，ふぐ",{"$f":"LEFT(D19,1)","v":""}]
[369,15,"魷",null,"い"]
[362,16,"魷","いか",""]
[361,17,"鯆",null,{"$f":"LEFT(D22,1)","v":"い"}]
[360,18,"鯆","いるか",""]
[359,19,"鰛",null,"い"]
[358,20,"鰛","いわし",{"$f":"LEFT(D25,1)","v":""}]
[357,21,"鰮",null,"い"]
[356,22,"鰮","いわし",""]
[355,23,"鰯",null,{"$f":"LEFT(D28,1)","v":"い"}]
[354,24,"鰯","いわし",""]
[353,25,"鮇",null,"い"]
[352,26,"鮇","いわな",{"$f":"LEFT(D31,1)","v":""}]
[351,27,"鯎",null,"う"]
[350,28,"鯎","うぐい",""]
[349,29,"鰻",null,{"$f":"LEFT(D34,1)","v":"う"}]
[348,30,"鰻","うなぎ",""]
[347,31,"鱗",null,"う"]
[346,32,"鱗","うろこ",{"$f":"LEFT(D37,1)","v":""}]
[345,33,"鱏",null,"え"]
[344,34,"鱏","えい",""]
[343,35,"鱛",null,{"$f":"LEFT(D40,1)","v":"え"}]
[342,36,"鱛","えそ",""]
[341,37,"魵",null,"え"]
[340,38,"魵","えび",{"$f":"LEFT(D43,1)","v":""}]
[339,39,"鰕",null,"え"]
[338,40,"鰕","えび",""]
[337,41,"鰓",null,{"$f":"LEFT(D46,1)","v":"え"}]
[336,42,"鰓","えら",""]
[335,43,"魞",null,"え"]
[334,44,"魞","えり",""]
[333,45,"鮖",null,"か"]
[332,46,"鮖","かじか",""]
[331,47,"鰍",null,"か"]
[330,48,"鰍","かじか",""]
[329,49,"鯑",null,"か"]
[328,50,"鯑","かずのこ",""]
[327,51,"鰹",null,"か"]
[326,52,"鰹","かつお",""]
[325,53,"魳",null,"か"]
[324,54,"魳","かます",""]
[323,55,"鱲",null,"か"]
[322,56,"鱲","からすみ",""]
[321,57,"魪",null,"か"]
[320,58,"魪","かれい",""]
[319,59,"鰈",null,"か"]
[318,60,"鰈","かれい",""]
[317,61,"鮍",null,"か"]
[316,62,"鮍","かわはぎ",""]
[315,63,"鱚",null,"き"]
[312,64,"鱚","きす",""]
[311,65,"鯢",null,"く"]
[310,66,"鯢","くじら",""]
[309,67,"鯨",null,"く"]
[308,68,"鯨","くじら",""]
[307,69,"鯉",null,"こ"]
[306,70,"鯉","こい",""]
[305,71,"鯒",null,"こ"]
[304,72,"鯒","こち",""]
[303,73,"鮗",null,"こ"]
[302,74,"鮗","このしろ",{"$f":"LEFT(D79,1)","v":""}]
[301,75,"鰶",null,"こ"]
[300,76,"鰶","このしろ",""]
[299,77,"鱓",null,"ご"]
[298,78,"鱓","ごまめ",""]
[297,79,"鱔",null,"ご"]
[296,80,"鱔","ごまめ",""]
[295,81,"鮴",null,"ご"]
[294,82,"鮴","ごり",""]
[293,83,"鮏",null,"さ"]
[292,84,"鮏","さけ",""]
[291,85,"鮭",null,"さ"]
[290,86,"鮭","さけ",""]
[289,87,"鯹",null,"さ"]
[288,88,"鯹","さけ",""]
[287,89,"鮄",null,"さ"]
[286,90,"鮄","さば",""]
[285,91,"鯖",null,"さ"]
[284,92,"鯖","さば",""]
[283,93,"鮫",null,"さ"]
[282,94,"鮫","さめ",""]
[281,95,"鱵",null,"さ"]
[280,96,"鱵","さより",""]
[279,97,"鰆",null,"さ"]
[278,98,"鰆","さわら",""]
[277,99,"鱪",null,"し"]
[276,100,"鱪","しいら",""]
[275,101,"鱰",null,"し"]
[274,102,"鱰","しいら",""]
[273,103,"鯱",null,"し"]
[272,104,"鯱","しゃち",""]
[271,105,"鱐",null,"し"]
[270,106,"鱐","しゃちほこ",""]
[269,107,"鮊",null,"し"]
[268,108,"鮊","しらうお",""]
[267,109,"鯳",null,"す"]
[266,110,"鯳","すけとうだら",""]
[265,111,"鮓",null,"す"]
[264,112,"鮓","すし",""]
[263,113,"鮨",null,"す"]
[262,114,"鮨","すし",""]
[261,115,"鱸",null,"す"]
[260,116,"鱸","すずき",""]
[259,117,"鯐",null,"す"]
[258,118,"鯐","すばしり",{"$f":"LEFT(D123,1)","v":""}]
[257,119,"鯣",null,{"$f":"LEFT(D124,1)","v":"す"}]
[256,120,"鯣","するめ",{"$f":"LEFT(D125,1)","v":""}]
[255,121,"鰑",null,{"$f":"LEFT(D126,1)","v":"す"}]
[254,122,"鰑","するめ",{"$f":"LEFT(D127,1)","v":""}]
[253,123,"鮬",null,{"$f":"LEFT(D128,1)","v":"せ"}]
[252,124,"鮬","せいご",{"$f":"LEFT(D129,1)","v":""}]
[251,125,"鮉",null,{"$f":"LEFT(D130,1)","v":"た"}]
[250,126,"鮉","たい",{"$f":"LEFT(D131,1)","v":""}]
[249,127,"鯛",null,{"$f":"LEFT(D132,1)","v":"た"}]
[248,128,"鯛","たい",{"$f":"LEFT(D133,1)","v":""}]
[247,129,"鰖",null,{"$f":"LEFT(D134,1)","v":"た"}]
[246,130,"鰖","たかべ",{"$f":"LEFT(D135,1)","v":""}]
[245,131,"鮹",null,{"$f":"LEFT(D136,1)","v":"た"}]
[244,132,"鮹","たこ",{"$f":"LEFT(D137,1)","v":""}]
[243,133,"鱆",null,{"$f":"LEFT(D138,1)","v":"た"}]
[242,134,"鱆","たこ",{"$f":"LEFT(D139,1)","v":""}]
[241,135,"魛",null,{"$f":"LEFT(D140,1)","v":"た"}]
[240,136,"魛","たちうお，えつ",{"$f":"LEFT(D141,1)","v":""}]
[239,137,"魣",null,{"$f":"LEFT(D142,1)","v":"た"}]
[238,138,"魣","たなご",{"$f":"LEFT(D143,1)","v":""}]
[237,139,"鰱",null,{"$f":"LEFT(D144,1)","v":"た"}]
[236,140,"鰱","たなご",{"$f":"LEFT(D145,1)","v":""}]
[235,141,"鱮",null,{"$f":"LEFT(D146,1)","v":"た"}]
[234,142,"鱮","たなご",{"$f":"LEFT(D147,1)","v":""}]
[233,143,"鱈",null,{"$f":"LEFT(D148,1)","v":"た"}]
[232,144,"鱈","たら",{"$f":"LEFT(D149,1)","v":""}]
[231,145,"鰔",null,{"$f":"LEFT(D150,1)","v":"た"}]
[230,146,"鰔","たら",{"$f":"LEFT(D151,1)","v":""}]
[229,147,"鱅",null,{"$f":"LEFT(D152,1)","v":"ち"}]
[228,148,"鱅","ちちかぶり",{"$f":"LEFT(D153,1)","v":""}]
[227,149,"鱘",null,{"$f":"LEFT(D154,1)","v":"ち"}]
[226,150,"鱘","ちょうざめ",{"$f":"LEFT(D155,1)","v":""}]
[225,151,"魡",null,{"$f":"LEFT(D156,1)","v":"つ"}]
[224,152,"魡","つ（る）",{"$f":"LEFT(D157,1)","v":""}]
[223,153,"鰢",null,{"$f":"LEFT(D158,1)","v":"つ"}]
[222,154,"鰢","つくら",{"$f":"LEFT(D159,1)","v":""}]
[221,155,"鯲",null,{"$f":"LEFT(D160,1)","v":"ど"}]
[220,156,"鯲","どじょう",{"$f":"LEFT(D161,1)","v":""}]
[219,157,"鰌",null,{"$f":"LEFT(D162,1)","v":"ど"}]
[218,158,"鰌","どじょう",{"$f":"LEFT(D163,1)","v":""}]
[217,159,"魹",null,{"$f":"LEFT(D164,1)","v":"と"}]
[216,160,"魹","とど",{"$f":"LEFT(D165,1)","v":""}]
[215,161,"魸",null,{"$f":"LEFT(D166,1)","v":"な"}]
[214,162,"魸","なます",{"$f":"LEFT(D167,1)","v":""}]
[213,163,"鱠",null,{"$f":"LEFT(D168,1)","v":"な"}]
[212,164,"鱠","なます",{"$f":"LEFT(D169,1)","v":""}]
[211,165,"鮀",null,{"$f":"LEFT(D170,1)","v":"な"}]
[210,166,"鮀","なまず",{"$f":"LEFT(D171,1)","v":""}]
[209,167,"鯰",null,{"$f":"LEFT(D172,1)","v":"な"}]
[208,168,"鯰","なまず",{"$f":"LEFT(D173,1)","v":""}]
[207,169,"鯡",null,{"$f":"LEFT(D174,1)","v":"に"}]
[206,170,"鯡","にしん",{"$f":"LEFT(D175,1)","v":""}]
[205,171,"鰊",null,{"$f":"LEFT(D176,1)","v":"に"}]
[204,172,"鰊","にしん",{"$f":"LEFT(D177,1)","v":""}]
[203,173,"鮸",null,{"$f":"LEFT(D178,1)","v":"に"}]
[202,174,"鮸","にべ",{"$f":"LEFT(D179,1)","v":""}]
[201,175,"鯁",null,{"$f":"LEFT(D180,1)","v":"の"}]
[200,176,"鯁","のぎ",{"$f":"LEFT(D181,1)","v":""}]
[199,177,"鰣",null,{"$f":"LEFT(D182,1)","v":"は"}]
[198,178,"鰣","はす",{"$f":"LEFT(D183,1)","v":""}]
[197,179,"鰰",null,{"$f":"LEFT(D184,1)","v":"は"}]
[196,180,"鰰","はたはた",{"$f":"LEFT(D185,1)","v":""}]
[195,181,"鱩",null,{"$f":"LEFT(D186,1)","v":"は"}]
[194,182,"鱩","はたはた",{"$f":"LEFT(D187,1)","v":""}]
[193,183,"魬",null,{"$f":"LEFT(D188,1)","v":"は"}]
[192,184,"魬","はまち",{"$f":"LEFT(D189,1)","v":""}]
[191,185,"鱧",null,{"$f":"LEFT(D190,1)","v":"は"}]
[190,186,"鱧","はも",{"$f":"LEFT(D191,1)","v":""}]
[189,187,"鮋",null,{"$f":"LEFT(D192,1)","v":"は"}]
[188,188,"鮋","はや",{"$f":"LEFT(D193,1)","v":""}]
[187,189,"鮠",null,{"$f":"LEFT(D194,1)","v":"は"}]
[186,190,"鮠","はや",{"$f":"LEFT(D195,1)","v":""}]
[185,191,"鰷",null,{"$f":"LEFT(D196,1)","v":"は"}]
[184,192,"鰷","はや，はえ",{"$f":"LEFT(D197,1)","v":""}]
[183,193,"鰚",null,{"$f":"LEFT(D198,1)","v":"は"}]
[182,194,"鰚","はらか",{"$f":"LEFT(D199,1)","v":""}]
[181,195,"鰉",null,{"$f":"LEFT(D200,1)","v":"ひ"}]
[180,196,"鰉","ひがい",{"$f":"LEFT(D201,1)","v":""}]
[179,197,"鯷",null,{"$f":"LEFT(D202,1)","v":"ひ"}]
[178,198,"鯷","ひしこ",{"$f":"LEFT(D203,1)","v":""}]
[177,199,"鮃",null,{"$f":"LEFT(D204,1)","v":"ひ"}]
[176,200,"鮃","ひらめ",{"$f":"LEFT(D205,1)","v":""}]
[175,201,"鰭",null,{"$f":"LEFT(D206,1)","v":"ひ"}]
[174,202,"鰭","ひれ",{"$f":"LEFT(D207,1)","v":""}]
[173,203,"鰾",null,{"$f":"LEFT(D208,1)","v":"う"}]
[172,204,"鰾","うきぶくろ",{"$f":"LEFT(D209,1)","v":""}]
[171,205,"鱶",null,{"$f":"LEFT(D210,1)","v":"ふ"}]
[170,206,"鱶","ふか",{"$f":"LEFT(D211,1)","v":""}]
[169,207,"鮐",null,{"$f":"LEFT(D212,1)","v":"ふ"}]
[168,208,"鮐","ふぐ",{"$f":"LEFT(D213,1)","v":""}]
[167,209,"鯸",null,{"$f":"LEFT(D214,1)","v":"ふ"}]
[166,210,"鯸","ふぐ",{"$f":"LEFT(D215,1)","v":""}]
[165,211,"鮒",null,{"$f":"LEFT(D216,1)","v":"ふ"}]
[164,212,"鮒","ふな",{"$f":"LEFT(D217,1)","v":""}]
[163,213,"鰤",null,{"$f":"LEFT(D218,1)","v":"ぶ"}]
[162,214,"鰤","ぶり",{"$f":"LEFT(D219,1)","v":""}]
[161,215,"鮱",null,{"$f":"LEFT(D220,1)","v":"ぼ"}]
[160,216,"鮱","ぼら",{"$f":"LEFT(D221,1)","v":""}]
[159,217,"鯔",null,{"$f":"LEFT(D222,1)","v":"ぼ"}]
[158,218,"鯔","ぼら",{"$f":"LEFT(D223,1)","v":""}]
[157,219,"鮪",null,{"$f":"LEFT(D224,1)","v":"ま"}]
[156,220,"鮪","まぐろ",{"$f":"LEFT(D225,1)","v":""}]
[155,221,"鮅",null,{"$f":"LEFT(D226,1)","v":"ま"}]
[154,222,"鮅","ます",{"$f":"LEFT(D227,1)","v":""}]
[153,223,"鱒",null,{"$f":"LEFT(D228,1)","v":"ま"}]
[152,224,"鱒","ます",{"$f":"LEFT(D229,1)","v":""}]
[151,225,"鮲",null,{"$f":"LEFT(D230,1)","v":"ま"}]
[150,226,"鮲","まて",{"$f":"LEFT(D231,1)","v":""}]
[149,227,"鯧",null,{"$f":"LEFT(D232,1)","v":"ま"}]
[148,228,"鯧","まながつお",{"$f":"LEFT(D233,1)","v":""}]
[147,229,"鯥",null,{"$f":"LEFT(D234,1)","v":"む"}]
[146,230,"鯥","むつ",{"$f":"LEFT(D235,1)","v":""}]
[145,231,"鱫",null,{"$f":"LEFT(D236,1)","v":"む"}]
[144,232,"鱫","むつ",{"$f":"LEFT(D237,1)","v":""}]
[143,233,"鰘",null,{"$f":"LEFT(D238,1)","v":"む"}]
[142,234,"鰘","むろあじ",{"$f":"LEFT(D239,1)","v":""}]
[141,235,"鱞",null,{"$f":"LEFT(D240,1)","v":"や"}]
[140,236,"鱞","やもお",{"$f":"LEFT(D241,1)","v":""}]
[139,237,"鰥",null,{"$f":"LEFT(D242,1)","v":"や"}]
[138,238,"鰥","やもお",{"$f":"LEFT(D243,1)","v":""}]
[137,239,"鰙",null,{"$f":"LEFT(D244,1)","v":"わ"}]
[136,240,"鰙","わかさぎ",{"$f":"LEFT(D245,1)","v":""}]
[135,241,"鰐",null,{"$f":"LEFT(D246,1)","v":"わ"}]
[134,242,"鰐","わに",{"$f":"LEFT(D247,1)","v":""}]
[133,243,"鱷",null,{"$f":"LEFT(D248,1)","v":"わ"}]
[132,244,"鱷","わに",{"$f":"LEFT(D249,1)","v":""}]
[131,245,"魥",null,{"$f":"LEFT(D250,1)","v":"キ"}]
[130,246,"魥","キョウ",{"$f":"LEFT(D251,1)","v":""}]
[129,247,"魭",null,{"$f":"LEFT(D252,1)","v":"ゲ"}]
[128,248,"魭","ゲン",{"$f":"LEFT(D253,1)","v":""}]
[127,249,"魫",null,{"$f":"LEFT(D254,1)","v":"シ"}]
[126,250,"魫","シン",{"$f":"LEFT(D255,1)","v":""}]
[125,251,"魨",null,{"$f":"LEFT(D256,1)","v":"ト"}]
[124,252,"魨","トン",{"$f":"LEFT(D257,1)","v":""}]
[123,253,"魮",null,{"$f":"LEFT(D258,1)","v":"ヒ"}]
[122,254,"魮","ヒ",{"$f":"LEFT(D259,1)","v":""}]
[121,255,"魴",null,{"$f":"LEFT(D260,1)","v":"ホ"}]
[120,256,"魴","ホウ，ボウ",{"$f":"LEFT(D261,1)","v":""}]
[119,257,"鮔",null,{"$f":"LEFT(D262,1)","v":"キ"}]
[118,258,"鮔","キョ",{"$f":"LEFT(D263,1)","v":""}]
[117,259,"魿",null,{"$f":"LEFT(D264,1)","v":"レ"}]
[116,260,"魿","レイ",{"$f":"LEFT(D265,1)","v":""}]
[115,261,"鮟",null,{"$f":"LEFT(D266,1)","v":"ア"}]
[114,262,"鮟","アン",{"$f":"LEFT(D267,1)","v":""}]
[113,263,"鮧",null,{"$f":"LEFT(D268,1)","v":"イ"}]
[112,264,"鮧","イ，テイ",{"$f":"LEFT(D269,1)","v":""}]
[111,265,"鮰",null,{"$f":"LEFT(D270,1)","v":"カ"}]
[110,266,"鮰","カイ",{"$f":"LEFT(D271,1)","v":""}]
[109,267,"鮚",null,{"$f":"LEFT(D272,1)","v":"キ"}]
[108,268,"鮚","キツ",{"$f":"LEFT(D273,1)","v":""}]
[107,269,"鮞",null,{"$f":"LEFT(D274,1)","v":"ジ"}]
[106,270,"鮞","ジ",{"$f":"LEFT(D275,1)","v":""}]
[105,271,"鮦",null,{"$f":"LEFT(D276,1)","v":"ト"}]
[104,272,"鮦","トウ",{"$f":"LEFT(D277,1)","v":""}]
[103,273,"鯀",null,{"$f":"LEFT(D278,1)","v":"コ"}]
[102,274,"鯀","コン",{"$f":"LEFT(D279,1)","v":""}]
[101,275,"鮼",null,{"$f":"LEFT(D280,1)","v":"シ"}]
[100,276,"鮼","シン",{"$f":"LEFT(D281,1)","v":""}]
[99,277,"鮾",null,{"$f":"LEFT(D282,1)","v":"ダ"}]
[98,278,"鮾","ダイ",{"$f":"LEFT(D283,1)","v":""}]
[97,279,"鮿",null,{"$f":"LEFT(D284,1)","v":"チ"}]
[96,280,"鮿","チョウ",{"$f":"LEFT(D285,1)","v":""}]
[95,281,"鮷",null,{"$f":"LEFT(D286,1)","v":"テ"}]
[94,282,"鮷","テイ",{"$f":"LEFT(D287,1)","v":""}]
[93,283,"鯝",null,{"$f":"LEFT(D288,1)","v":"コ"}]
[92,284,"鯝","コ",{"$f":"LEFT(D289,1)","v":""}]
[91,285,"鯤",null,{"$f":"LEFT(D290,1)","v":"コ"}]
[90,286,"鯤","コン",{"$f":"LEFT(D291,1)","v":""}]
[89,287,"鯯",null,{"$f":"LEFT(D292,1)","v":"セ"}]
[88,288,"鯯","セイ",{"$f":"LEFT(D293,1)","v":""}]
[87,289,"鯫",null,{"$f":"LEFT(D294,1)","v":"ソ"}]
[86,290,"鯫","ソウ",{"$f":"LEFT(D295,1)","v":""}]
[85,291,"鯘",null,{"$f":"LEFT(D296,1)","v":"ダ"}]
[84,292,"鯘","ダイ",{"$f":"LEFT(D297,1)","v":""}]
[83,293,"鯟",null,{"$f":"LEFT(D298,1)","v":"ト"}]
[82,294,"鯟","トウ",{"$f":"LEFT(D299,1)","v":""}]
[81,295,"鯪",null,{"$f":"LEFT(D300,1)","v":"リ"}]
[80,296,"鯪","リョウ",{"$f":"LEFT(D301,1)","v":""}]
[79,297,"鰄",null,{"$f":"LEFT(D302,1)","v":"イ"}]
[78,298,"鰄","イ",{"$f":"LEFT(D303,1)","v":""}]
[77,299,"鰋",null,{"$f":"LEFT(D304,1)","v":"エ"}]
[76,300,"鰋","エン",{"$f":"LEFT(D305,1)","v":""}]
[75,301,"鰀",null,{"$f":"LEFT(D306,1)","v":"カ"}]
[74,302,"鰀","カン",{"$f":"LEFT(D307,1)","v":""}]
[73,303,"鯺",null,{"$f":"LEFT(D308,1)","v":"シ"}]
[72,304,"鯺","ショ",{"$f":"LEFT(D309,1)","v":""}]
[71,305,"鯽",null,{"$f":"LEFT(D310,1)","v":"ソ"}]
[70,306,"鯽","ソク",{"$f":"LEFT(D311,1)","v":""}]
[69,307,"鰂",null,{"$f":"LEFT(D312,1)","v":"ソ"}]
[68,308,"鰂","ソク",{"$f":"LEFT(D313,1)","v":""}]
[67,309,"鰏",null,{"$f":"LEFT(D314,1)","v":"ヒ"}]
[66,310,"鰏","ヒョク",{"$f":"LEFT(D315,1)","v":""}]
[65,311,"鯿",null,{"$f":"LEFT(D316,1)","v":"ヘ"}]
[64,312,"鯿","ヘン",{"$f":"LEFT(D317,1)","v":""}]
[63,313,"鰞",null,{"$f":"LEFT(D318,1)","v":"ウ"}]
[62,314,"鰞","ウ",""]
[61,315,"鰜",null,"ケ"]
[60,316,"鰜","ケン",""]
[59,317,"鰪",null,"コ"]
[58,318,"鰪","コウ",""]
[57,319,"鰦",null,"シ"]
[56,320,"鰦","シ",""]
[55,321,"鰨",null,"チ"]
[54,322,"鰨","チョウ",""]
[53,323,"鰩",null,"ヨ"]
[52,324,"鰩","ヨウ",""]
[51,325,"鰡",null,"リ"]
[50,326,"鰡","リュウ",""]
[49,327,"鱇",null,"コ"]
[48,328,"鱇","コウ",""]
[47,329,"鰽",null,"シ"]
[46,330,"鰽","シュウ",""]
[45,331,"鱃",null,"シ"]
[44,332,"鱃","シュウ",""]
[43,333,"鱄",null,"セ"]
[42,334,"鱄","セン，タン",""]
[41,335,"鱁",null,"チ"]
[40,336,"鱁","チク",""]
[39,337,"鱎",null,"キ"]
[38,338,"鱎","キョウ",""]
[37,339,"鱖",null,"ケ"]
[36,340,"鱖","ケイ",""]
[35,341,"鱣",null,"テ"]
[34,342,"鱣","テン，セン",""]
[33,343,"鱝",null,"フ"]
[32,344,"鱝","フン",""]
[31,345,"鱨",null,"シ"]
[30,346,"鱨","ショウ",""]
[29,347,"魚",null,"う"]
[28,348,"魚","うお，さかな",""]
[27,349,"鮆",null,"え"]
[26,350,"鮆","えつ",""]
[25,351,"鰲",null,"お"]
[24,352,"鰲","おおがめ",""]
[23,353,"鰧",null,"お"]
[22,354,"鰧","おこぜ",""]
[21,355,"魯",null,"お"]
[20,356,"魯","おろ（か）",""]
[19,357,"鱟",null,"か"]
[18,358,"鱟","かぶとがに",""]
[17,359,"鯊",null,"は"]
[16,360,"鯊","はぜ",""]
[15,361,"鯈",null,"は"]
[14,362,"鯈","はや，はえ",""]
[13,363,"鮝",null,"ふ"]
[12,364,"鮝","ふか",""]
[11,365,"鯗",null,"ふ"]
[10,366,"鯗","ふか",""]
[9,367,"鰵",null,"ビ"]
[8,368,"鰵","ビン",""]
[7,369,"鱉",null,"ベ"]
[6,370,"鱉","ベツ",""]
[5,371,"鱻",null,"セ"]
[4,372,"鱻","セン",""]
[3,373,"漁",null,"ギ"]
[2,374,"漁","ギョ，リョウ，いさ（る），あさ（る）",{"$f":"LEFT(D379,1)","v":""}]
[1,375,"鷠",null,{"$f":"LEFT(D380,1)","v":"ギ"}]
[null,376,"鷠","ギョ",{"$f":"LEFT(D383,1)","v":""}]

{"sheet":"訓読み一覧","index":2,"n_rows":134,"n_cols":3,"rows_kept":134,"cut":false,"hidden":false,"merged":[]}
[]
[]
[null,"鮮","あざ（やか）"]
[null,"鯏","あさり"]
[null,"鰺","あじ"]
[null,"鮎","あゆ"]
[null,"鮑","あわび"]
[null,"鰒","あわび，ふぐ"]
[null,"鮟","アン"]
[null,"魷","いか"]
[null,"鯆","いるか"]
[null,"鰮","いわし"]
[null,"鰯","いわし"]
[null,"鮇","いわな"]
[null,"魚","うお，さかな"]
[null,"鰾","うきぶくろ"]
[null,"鯎","うぐい"]
[null,"鰻","うなぎ"]
[null,"鱗","うろこ"]
[null,"鱏","えい"]
[null,"鱛","えそ"]
[null,"鮆","えつ"]
[null,"魵","えび"]
[null,"鰕","えび"]
[null,"鰓","えら"]
[null,"魞","えり"]
[null,"鰲","おおがめ"]
[null,"鰧","おこぜ"]
[null,"魯","おろ（か）"]
[null,"鮖","かじか"]
[null,"鰍","かじか"]
[null,"鯑","かずのこ"]
[null,"鰹","かつお"]
[null,"鱟","かぶとがに"]
[null,"魳","かます"]
[null,"鱲","からすみ"]
[null,"魪","かれい"]
[null,"鰈","かれい"]
[null,"鮍","かわはぎ"]
[null,"鱚","きす"]
[null,"鯢","くじら"]
[null,"鯨","くじら"]
[null,"鯉","こい"]
[null,"鱇","コウ"]
[null,"鯒","こち"]
[null,"鮗","このしろ"]
[null,"鰶","このしろ"]
[null,"鱓","ごまめ"]
[null,"鱔","ごまめ"]
[null,"鮴","ごり"]
[null,"鮏","さけ"]
[null,"鮭","さけ"]
[null,"鯹","さけ"]
[null,"鮄","さば"]
[null,"鯖","さば"]
[null,"鮫","さめ"]
[null,"鱵","さより"]
[null,"鰆","さわら"]
[null,"鱰","しいら"]
[null,"鯱","しゃち"]
[null,"鱐","しゃちほこ"]
[null,"鮊","しらうお"]
[null,"鯳","すけとうだら"]
[null,"鮓","すし"]
[null,"鮨","すし"]
[null,"鱸","すずき"]
[null,"鯐","すばしり"]
[null,"鯣","するめ"]
[null,"鰑","するめ"]
[null,"鮬","せいご"]
[null,"鮉","たい"]
[null,"鯛","たい"]
[null,"鰖","たかべ"]
[null,"鮹","たこ"]
[null,"鱆","たこ"]
[null,"魛","たちうお，えつ"]
[null,"魣","たなご"]
[null,"鰱","たなご"]
[null,"鱮","たなご"]
[null,"鱈","たら"]
[null,"鰔","たら"]
[null,"鱁","チク"]
[null,"鱅","ちちかぶり"]
[null,"鱘","ちょうざめ"]
[null,"魡","つ（る）"]
[null,"鰢","つくら"]
[null,"鯲","どじょう"]
[null,"鰌","どじょう"]
[null,"魹","とど"]
[null,"魸","なます"]
[null,"鱠","なます"]
[null,"鮀","なまず"]
[null,"鯰","なまず"]
[null,"鯡","にしん"]
[null,"鰊","にしん"]
[null,"鮸","にべ"]
[null,"鯁","のぎ"]
[null,"鰣","はす"]
[null,"鯊","はぜ"]
[null,"鰰","はたはた"]
[null,"鱩","はたはた"]
[null,"魬","はまち"]
[null,"鱧","はも"]
[null,"鮋","はや"]
[null,"鮠","はや"]
[null,"鰷","はや，はえ"]
[null,"鯈","はや，はえ"]
[null,"鰚","はらか"]
[null,"鰉","ひがい"]
[null,"鯷","ひしこ"]
[null,"鮃","ひらめ"]
[null,"鰭","ひれ"]
[null,"鱶","ふか"]
[null,"鮝","ふか"]
[null,"鯗","ふか"]
[null,"鮐","ふぐ"]
[null,"鯸","ふぐ"]
[null,"鮒","ふな"]
[null,"鰤","ぶり"]
[null,"鮱","ぼら"]
[null,"鯔","ぼら"]
[null,"鮪","まぐろ"]
[null,"鮅","ます"]
[null,"鱒","ます"]
[null,"鮲","まて"]
[null,"鯧","まながつお"]
[null,"鯥","むつ"]
[null,"鱫","むつ"]
[null,"鰘","むろあじ"]
[null,"鱞","やもお"]
[null,"鰥","やもお"]
[null,"鰙","わかさぎ"]
[null,"鰐","わに"]
[null,"鱷","わに"]